hadoop-hdfs-dev mailing list archives

Site index · List index
Message view « Date » · « Thread »
Top « Date » · « Thread »
From Apache Jenkins Server <jenk...@builds.apache.org>
Subject Build failed in Jenkins: Hadoop-Hdfs-trunk-Java8 #261
Date Thu, 30 Jul 2015 12:50:22 GMT
See <https://builds.apache.org/job/Hadoop-Hdfs-trunk-Java8/261/changes>

Changes:

[jlowe] YARN-3950. Add unique SHELL_ID environment variable to DistributedShell. Contributed
by Robert Kanter

[jlowe] HADOOP-10945. 4-digit octal umask permissions throws a parse error. Contributed by
Chang Li

[kasha] YARN-2768. Avoid cloning Resource in FSAppAttempt#updateDemand. (Hong Zhiguo via kasha)

[rohithsharmaks] YARN-3919. NPEs' while stopping service after exception during CommonNodeLabelsManager#start.
(varun saxena via rohithsharmaks)

[wheat9] HDFS-8816. Improve visualization for the Datanode tab in the NN UI. Contributed by
Haohui Mai.

------------------------------------------
[...truncated 6986 lines...]
Tests run: 4, Failures: 0, Errors: 0, Skipped: 0, Time elapsed: 23 sec - in org.apache.hadoop.hdfs.server.namenode.TestBackupNode
Java HotSpot(TM) 64-Bit Server VM warning: ignoring option MaxPermSize=768m; support was removed
in 8.0
Running org.apache.hadoop.hdfs.server.namenode.TestMalformedURLs
Tests run: 1, Failures: 0, Errors: 0, Skipped: 0, Time elapsed: 3.982 sec - in org.apache.hadoop.hdfs.server.namenode.TestMalformedURLs
Java HotSpot(TM) 64-Bit Server VM warning: ignoring option MaxPermSize=768m; support was removed
in 8.0
Running org.apache.hadoop.hdfs.server.namenode.TestFileLimit
Tests run: 4, Failures: 0, Errors: 0, Skipped: 0, Time elapsed: 7.604 sec - in org.apache.hadoop.hdfs.server.namenode.TestFileLimit
Java HotSpot(TM) 64-Bit Server VM warning: ignoring option MaxPermSize=768m; support was removed
in 8.0
Running org.apache.hadoop.hdfs.server.namenode.TestValidateConfigurationSettings
Tests run: 3, Failures: 0, Errors: 0, Skipped: 0, Time elapsed: 3.762 sec - in org.apache.hadoop.hdfs.server.namenode.TestValidateConfigurationSettings
Java HotSpot(TM) 64-Bit Server VM warning: ignoring option MaxPermSize=768m; support was removed
in 8.0
Running org.apache.hadoop.hdfs.server.namenode.TestCreateEditsLog
Tests run: 1, Failures: 0, Errors: 0, Skipped: 0, Time elapsed: 4.758 sec - in org.apache.hadoop.hdfs.server.namenode.TestCreateEditsLog
Java HotSpot(TM) 64-Bit Server VM warning: ignoring option MaxPermSize=768m; support was removed
in 8.0
Running org.apache.hadoop.hdfs.server.namenode.TestFSNamesystem
Tests run: 8, Failures: 0, Errors: 0, Skipped: 0, Time elapsed: 2.735 sec - in org.apache.hadoop.hdfs.server.namenode.TestFSNamesystem
Java HotSpot(TM) 64-Bit Server VM warning: ignoring option MaxPermSize=768m; support was removed
in 8.0
Running org.apache.hadoop.hdfs.server.namenode.TestFSPermissionChecker
Tests run: 15, Failures: 0, Errors: 0, Skipped: 0, Time elapsed: 1.524 sec - in org.apache.hadoop.hdfs.server.namenode.TestFSPermissionChecker
Java HotSpot(TM) 64-Bit Server VM warning: ignoring option MaxPermSize=768m; support was removed
in 8.0
Running org.apache.hadoop.hdfs.server.namenode.TestSaveNamespace
Tests run: 14, Failures: 0, Errors: 0, Skipped: 0, Time elapsed: 10.907 sec - in org.apache.hadoop.hdfs.server.namenode.TestSaveNamespace
Java HotSpot(TM) 64-Bit Server VM warning: ignoring option MaxPermSize=768m; support was removed
in 8.0
Running org.apache.hadoop.hdfs.server.namenode.TestEditLogRace
Tests run: 4, Failures: 0, Errors: 0, Skipped: 0, Time elapsed: 30.569 sec - in org.apache.hadoop.hdfs.server.namenode.TestEditLogRace
Java HotSpot(TM) 64-Bit Server VM warning: ignoring option MaxPermSize=768m; support was removed
in 8.0
Running org.apache.hadoop.hdfs.server.namenode.TestStartup
Tests run: 10, Failures: 0, Errors: 0, Skipped: 0, Time elapsed: 29.386 sec - in org.apache.hadoop.hdfs.server.namenode.TestStartup
Java HotSpot(TM) 64-Bit Server VM warning: ignoring option MaxPermSize=768m; support was removed
in 8.0
Running org.apache.hadoop.hdfs.server.namenode.TestCheckpoint
Tests run: 38, Failures: 0, Errors: 0, Skipped: 0, Time elapsed: 69.437 sec - in org.apache.hadoop.hdfs.server.namenode.TestCheckpoint
Java HotSpot(TM) 64-Bit Server VM warning: ignoring option MaxPermSize=768m; support was removed
in 8.0
Running org.apache.hadoop.hdfs.server.namenode.TestParallelImageWrite
Tests run: 1, Failures: 0, Errors: 0, Skipped: 0, Time elapsed: 14.127 sec - in org.apache.hadoop.hdfs.server.namenode.TestParallelImageWrite
Java HotSpot(TM) 64-Bit Server VM warning: ignoring option MaxPermSize=768m; support was removed
in 8.0
Running org.apache.hadoop.hdfs.server.namenode.TestFileContextAcl
Tests run: 64, Failures: 0, Errors: 0, Skipped: 0, Time elapsed: 23.926 sec - in org.apache.hadoop.hdfs.server.namenode.TestFileContextAcl
Java HotSpot(TM) 64-Bit Server VM warning: ignoring option MaxPermSize=768m; support was removed
in 8.0
Running org.apache.hadoop.hdfs.server.namenode.TestAddBlockRetry
Tests run: 2, Failures: 0, Errors: 0, Skipped: 0, Time elapsed: 11.25 sec - in org.apache.hadoop.hdfs.server.namenode.TestAddBlockRetry
Java HotSpot(TM) 64-Bit Server VM warning: ignoring option MaxPermSize=768m; support was removed
in 8.0
Running org.apache.hadoop.hdfs.server.namenode.TestINodeFile
Tests run: 26, Failures: 0, Errors: 0, Skipped: 0, Time elapsed: 44.277 sec - in org.apache.hadoop.hdfs.server.namenode.TestINodeFile
Java HotSpot(TM) 64-Bit Server VM warning: ignoring option MaxPermSize=768m; support was removed
in 8.0
Running org.apache.hadoop.hdfs.server.namenode.TestNameNodeRetryCacheMetrics
Tests run: 1, Failures: 0, Errors: 0, Skipped: 0, Time elapsed: 7.076 sec - in org.apache.hadoop.hdfs.server.namenode.TestNameNodeRetryCacheMetrics
Java HotSpot(TM) 64-Bit Server VM warning: ignoring option MaxPermSize=768m; support was removed
in 8.0
Running org.apache.hadoop.hdfs.server.namenode.TestGetImageServlet
Tests run: 1, Failures: 0, Errors: 0, Skipped: 0, Time elapsed: 1.556 sec - in org.apache.hadoop.hdfs.server.namenode.TestGetImageServlet
Java HotSpot(TM) 64-Bit Server VM warning: ignoring option MaxPermSize=768m; support was removed
in 8.0
Running org.apache.hadoop.hdfs.server.namenode.TestAuditLogs
Tests run: 14, Failures: 0, Errors: 0, Skipped: 0, Time elapsed: 32.546 sec - in org.apache.hadoop.hdfs.server.namenode.TestAuditLogs
Java HotSpot(TM) 64-Bit Server VM warning: ignoring option MaxPermSize=768m; support was removed
in 8.0
Running org.apache.hadoop.hdfs.server.namenode.TestFSNamesystemMBean
Tests run: 2, Failures: 0, Errors: 0, Skipped: 0, Time elapsed: 5.139 sec - in org.apache.hadoop.hdfs.server.namenode.TestFSNamesystemMBean
Java HotSpot(TM) 64-Bit Server VM warning: ignoring option MaxPermSize=768m; support was removed
in 8.0
Running org.apache.hadoop.hdfs.server.namenode.snapshot.TestSnapshotFileLength
Tests run: 2, Failures: 0, Errors: 0, Skipped: 0, Time elapsed: 6.064 sec - in org.apache.hadoop.hdfs.server.namenode.snapshot.TestSnapshotFileLength
Java HotSpot(TM) 64-Bit Server VM warning: ignoring option MaxPermSize=768m; support was removed
in 8.0
Running org.apache.hadoop.hdfs.server.namenode.snapshot.TestXAttrWithSnapshot
Tests run: 8, Failures: 0, Errors: 0, Skipped: 0, Time elapsed: 8.371 sec - in org.apache.hadoop.hdfs.server.namenode.snapshot.TestXAttrWithSnapshot
Java HotSpot(TM) 64-Bit Server VM warning: ignoring option MaxPermSize=768m; support was removed
in 8.0
Running org.apache.hadoop.hdfs.server.namenode.snapshot.TestSnapshotDiffReport
Tests run: 8, Failures: 0, Errors: 0, Skipped: 0, Time elapsed: 17.647 sec - in org.apache.hadoop.hdfs.server.namenode.snapshot.TestSnapshotDiffReport
Java HotSpot(TM) 64-Bit Server VM warning: ignoring option MaxPermSize=768m; support was removed
in 8.0
Running org.apache.hadoop.hdfs.server.namenode.snapshot.TestSnapshotManager
Tests run: 1, Failures: 0, Errors: 0, Skipped: 0, Time elapsed: 0.569 sec - in org.apache.hadoop.hdfs.server.namenode.snapshot.TestSnapshotManager
Java HotSpot(TM) 64-Bit Server VM warning: ignoring option MaxPermSize=768m; support was removed
in 8.0
Running org.apache.hadoop.hdfs.server.namenode.snapshot.TestSnapshot
Tests run: 6, Failures: 0, Errors: 0, Skipped: 0, Time elapsed: 79.914 sec - in org.apache.hadoop.hdfs.server.namenode.snapshot.TestSnapshot
Java HotSpot(TM) 64-Bit Server VM warning: ignoring option MaxPermSize=768m; support was removed
in 8.0
Running org.apache.hadoop.hdfs.server.namenode.snapshot.TestSnapshotBlocksMap
Tests run: 7, Failures: 0, Errors: 0, Skipped: 0, Time elapsed: 24.671 sec - in org.apache.hadoop.hdfs.server.namenode.snapshot.TestSnapshotBlocksMap
Java HotSpot(TM) 64-Bit Server VM warning: ignoring option MaxPermSize=768m; support was removed
in 8.0
Running org.apache.hadoop.hdfs.server.namenode.snapshot.TestNestedSnapshots
Tests run: 5, Failures: 0, Errors: 0, Skipped: 0, Time elapsed: 51.998 sec - in org.apache.hadoop.hdfs.server.namenode.snapshot.TestNestedSnapshots
Java HotSpot(TM) 64-Bit Server VM warning: ignoring option MaxPermSize=768m; support was removed
in 8.0
Running org.apache.hadoop.hdfs.server.namenode.snapshot.TestUpdatePipelineWithSnapshots
Tests run: 1, Failures: 0, Errors: 0, Skipped: 0, Time elapsed: 9.528 sec - in org.apache.hadoop.hdfs.server.namenode.snapshot.TestUpdatePipelineWithSnapshots
Java HotSpot(TM) 64-Bit Server VM warning: ignoring option MaxPermSize=768m; support was removed
in 8.0
Running org.apache.hadoop.hdfs.server.namenode.snapshot.TestSnapshotDeletion
Tests run: 17, Failures: 0, Errors: 0, Skipped: 0, Time elapsed: 61.307 sec - in org.apache.hadoop.hdfs.server.namenode.snapshot.TestSnapshotDeletion
Java HotSpot(TM) 64-Bit Server VM warning: ignoring option MaxPermSize=768m; support was removed
in 8.0
Running org.apache.hadoop.hdfs.server.namenode.snapshot.TestRenameWithSnapshots
Tests run: 36, Failures: 0, Errors: 0, Skipped: 0, Time elapsed: 127.691 sec - in org.apache.hadoop.hdfs.server.namenode.snapshot.TestRenameWithSnapshots
Java HotSpot(TM) 64-Bit Server VM warning: ignoring option MaxPermSize=768m; support was removed
in 8.0
Running org.apache.hadoop.hdfs.server.namenode.snapshot.TestAclWithSnapshot
Tests run: 16, Failures: 0, Errors: 0, Skipped: 0, Time elapsed: 12.39 sec - in org.apache.hadoop.hdfs.server.namenode.snapshot.TestAclWithSnapshot
Java HotSpot(TM) 64-Bit Server VM warning: ignoring option MaxPermSize=768m; support was removed
in 8.0
Running org.apache.hadoop.hdfs.server.namenode.snapshot.TestDisallowModifyROSnapshot
Tests run: 11, Failures: 0, Errors: 0, Skipped: 0, Time elapsed: 3.972 sec - in org.apache.hadoop.hdfs.server.namenode.snapshot.TestDisallowModifyROSnapshot
Java HotSpot(TM) 64-Bit Server VM warning: ignoring option MaxPermSize=768m; support was removed
in 8.0
Running org.apache.hadoop.hdfs.server.namenode.snapshot.TestCheckpointsWithSnapshots
Tests run: 1, Failures: 0, Errors: 0, Skipped: 0, Time elapsed: 4.984 sec - in org.apache.hadoop.hdfs.server.namenode.snapshot.TestCheckpointsWithSnapshots
Java HotSpot(TM) 64-Bit Server VM warning: ignoring option MaxPermSize=768m; support was removed
in 8.0
Running org.apache.hadoop.hdfs.server.namenode.snapshot.TestFileWithSnapshotFeature
Tests run: 1, Failures: 0, Errors: 0, Skipped: 0, Time elapsed: 0.428 sec - in org.apache.hadoop.hdfs.server.namenode.snapshot.TestFileWithSnapshotFeature
Java HotSpot(TM) 64-Bit Server VM warning: ignoring option MaxPermSize=768m; support was removed
in 8.0
Running org.apache.hadoop.hdfs.server.namenode.snapshot.TestSnapshotReplication
Tests run: 3, Failures: 0, Errors: 0, Skipped: 0, Time elapsed: 10.054 sec - in org.apache.hadoop.hdfs.server.namenode.snapshot.TestSnapshotReplication
Java HotSpot(TM) 64-Bit Server VM warning: ignoring option MaxPermSize=768m; support was removed
in 8.0
Running org.apache.hadoop.hdfs.server.namenode.snapshot.TestSnapshottableDirListing
Tests run: 2, Failures: 0, Errors: 0, Skipped: 0, Time elapsed: 6.611 sec - in org.apache.hadoop.hdfs.server.namenode.snapshot.TestSnapshottableDirListing
Java HotSpot(TM) 64-Bit Server VM warning: ignoring option MaxPermSize=768m; support was removed
in 8.0
Running org.apache.hadoop.hdfs.server.namenode.snapshot.TestSnapshotNameWithInvalidCharacters
Tests run: 2, Failures: 0, Errors: 0, Skipped: 0, Time elapsed: 5.751 sec - in org.apache.hadoop.hdfs.server.namenode.snapshot.TestSnapshotNameWithInvalidCharacters
Java HotSpot(TM) 64-Bit Server VM warning: ignoring option MaxPermSize=768m; support was removed
in 8.0
Running org.apache.hadoop.hdfs.server.namenode.snapshot.TestSnapshotStatsMXBean
Tests run: 1, Failures: 0, Errors: 0, Skipped: 0, Time elapsed: 3.864 sec - in org.apache.hadoop.hdfs.server.namenode.snapshot.TestSnapshotStatsMXBean
Java HotSpot(TM) 64-Bit Server VM warning: ignoring option MaxPermSize=768m; support was removed
in 8.0
Running org.apache.hadoop.hdfs.server.namenode.snapshot.TestOpenFilesWithSnapshot
Tests run: 7, Failures: 0, Errors: 0, Skipped: 0, Time elapsed: 54.585 sec - in org.apache.hadoop.hdfs.server.namenode.snapshot.TestOpenFilesWithSnapshot
Java HotSpot(TM) 64-Bit Server VM warning: ignoring option MaxPermSize=768m; support was removed
in 8.0
Running org.apache.hadoop.hdfs.server.namenode.snapshot.TestSnapshotRename
Tests run: 6, Failures: 0, Errors: 0, Skipped: 0, Time elapsed: 12.812 sec - in org.apache.hadoop.hdfs.server.namenode.snapshot.TestSnapshotRename
Java HotSpot(TM) 64-Bit Server VM warning: ignoring option MaxPermSize=768m; support was removed
in 8.0
Running org.apache.hadoop.hdfs.server.namenode.snapshot.TestSnapshotMetrics
Tests run: 2, Failures: 0, Errors: 0, Skipped: 0, Time elapsed: 7.836 sec - in org.apache.hadoop.hdfs.server.namenode.snapshot.TestSnapshotMetrics
Java HotSpot(TM) 64-Bit Server VM warning: ignoring option MaxPermSize=768m; support was removed
in 8.0
Running org.apache.hadoop.hdfs.server.namenode.snapshot.TestINodeFileUnderConstructionWithSnapshot
Tests run: 4, Failures: 0, Errors: 0, Skipped: 0, Time elapsed: 12.039 sec - in org.apache.hadoop.hdfs.server.namenode.snapshot.TestINodeFileUnderConstructionWithSnapshot
Java HotSpot(TM) 64-Bit Server VM warning: ignoring option MaxPermSize=768m; support was removed
in 8.0
Running org.apache.hadoop.hdfs.server.namenode.snapshot.TestSetQuotaWithSnapshot
Tests run: 2, Failures: 0, Errors: 0, Skipped: 0, Time elapsed: 7.184 sec - in org.apache.hadoop.hdfs.server.namenode.snapshot.TestSetQuotaWithSnapshot
Java HotSpot(TM) 64-Bit Server VM warning: ignoring option MaxPermSize=768m; support was removed
in 8.0
Running org.apache.hadoop.hdfs.server.namenode.snapshot.TestSnapshotListing
Tests run: 1, Failures: 0, Errors: 0, Skipped: 0, Time elapsed: 4.443 sec - in org.apache.hadoop.hdfs.server.namenode.snapshot.TestSnapshotListing
Java HotSpot(TM) 64-Bit Server VM warning: ignoring option MaxPermSize=768m; support was removed
in 8.0
Running org.apache.hadoop.hdfs.server.namenode.snapshot.TestFileContextSnapshot
Tests run: 2, Failures: 0, Errors: 0, Skipped: 0, Time elapsed: 6.913 sec - in org.apache.hadoop.hdfs.server.namenode.snapshot.TestFileContextSnapshot
Java HotSpot(TM) 64-Bit Server VM warning: ignoring option MaxPermSize=768m; support was removed
in 8.0
Running org.apache.hadoop.hdfs.server.namenode.TestSecondaryWebUi
Tests run: 1, Failures: 0, Errors: 0, Skipped: 0, Time elapsed: 4.004 sec - in org.apache.hadoop.hdfs.server.namenode.TestSecondaryWebUi
Java HotSpot(TM) 64-Bit Server VM warning: ignoring option MaxPermSize=768m; support was removed
in 8.0
Running org.apache.hadoop.hdfs.server.namenode.TestAuditLogger
Tests run: 6, Failures: 0, Errors: 0, Skipped: 0, Time elapsed: 10.268 sec - in org.apache.hadoop.hdfs.server.namenode.TestAuditLogger
Java HotSpot(TM) 64-Bit Server VM warning: ignoring option MaxPermSize=768m; support was removed
in 8.0
Running org.apache.hadoop.hdfs.server.namenode.TestSnapshotPathINodes
Tests run: 6, Failures: 0, Errors: 0, Skipped: 0, Time elapsed: 5.486 sec - in org.apache.hadoop.hdfs.server.namenode.TestSnapshotPathINodes
Java HotSpot(TM) 64-Bit Server VM warning: ignoring option MaxPermSize=768m; support was removed
in 8.0
Running org.apache.hadoop.hdfs.server.namenode.TestCheckPointForSecurityTokens
Tests run: 1, Failures: 0, Errors: 0, Skipped: 0, Time elapsed: 8.976 sec - in org.apache.hadoop.hdfs.server.namenode.TestCheckPointForSecurityTokens
Java HotSpot(TM) 64-Bit Server VM warning: ignoring option MaxPermSize=768m; support was removed
in 8.0
Running org.apache.hadoop.hdfs.server.namenode.TestEditLogJournalFailures
Tests run: 6, Failures: 0, Errors: 0, Skipped: 0, Time elapsed: 9.512 sec - in org.apache.hadoop.hdfs.server.namenode.TestEditLogJournalFailures
Java HotSpot(TM) 64-Bit Server VM warning: ignoring option MaxPermSize=768m; support was removed
in 8.0
Running org.apache.hadoop.hdfs.server.namenode.TestCacheDirectives
Tests run: 13, Failures: 0, Errors: 0, Skipped: 0, Time elapsed: 87.824 sec - in org.apache.hadoop.hdfs.server.namenode.TestCacheDirectives
Java HotSpot(TM) 64-Bit Server VM warning: ignoring option MaxPermSize=768m; support was removed
in 8.0
Running org.apache.hadoop.hdfs.server.namenode.web.resources.TestWebHdfsDataLocality

Results :

Failed tests: 
  TestDFSAdmin.testGetReconfigurationStatus:183->testGetReconfigurationStatus:145 
Expected: is <4>
     but: was <8>

Tests in error: 
  TestFSInputChecker.testFSInputChecker:326 ยป NoClassDefFound org/apache/hadoop/...

Tests run: 2150, Failures: 1, Errors: 1, Skipped: 12

[INFO]                                                                         
[INFO] ------------------------------------------------------------------------
[INFO] Skipping Apache Hadoop HttpFS
[INFO] This project has been banned from the build due to previous failures.
[INFO] ------------------------------------------------------------------------
[INFO]                                                                         
[INFO] ------------------------------------------------------------------------
[INFO] Skipping Apache Hadoop HDFS BookKeeper Journal
[INFO] This project has been banned from the build due to previous failures.
[INFO] ------------------------------------------------------------------------
[INFO]                                                                         
[INFO] ------------------------------------------------------------------------
[INFO] Skipping Apache Hadoop HDFS-NFS
[INFO] This project has been banned from the build due to previous failures.
[INFO] ------------------------------------------------------------------------
[INFO]                                                                         
[INFO] ------------------------------------------------------------------------
[INFO] Building Apache Hadoop HDFS Project 3.0.0-SNAPSHOT
[INFO] ------------------------------------------------------------------------
[INFO] 
[INFO] --- maven-clean-plugin:2.5:clean (default-clean) @ hadoop-hdfs-project ---
[INFO] Deleting <https://builds.apache.org/job/Hadoop-Hdfs-trunk-Java8/ws/hadoop-hdfs-project/target>
[INFO] 
[INFO] --- maven-antrun-plugin:1.7:run (create-testdirs) @ hadoop-hdfs-project ---
[INFO] Executing tasks

main:
    [mkdir] Created dir: <https://builds.apache.org/job/Hadoop-Hdfs-trunk-Java8/ws/hadoop-hdfs-project/target/test-dir>
[INFO] Executed tasks
[INFO] 
[INFO] --- maven-source-plugin:2.3:jar-no-fork (hadoop-java-sources) @ hadoop-hdfs-project
---
[INFO] 
[INFO] --- maven-source-plugin:2.3:test-jar-no-fork (hadoop-java-sources) @ hadoop-hdfs-project
---
[INFO] 
[INFO] --- maven-enforcer-plugin:1.3.1:enforce (dist-enforce) @ hadoop-hdfs-project ---
[INFO] 
[INFO] --- maven-site-plugin:3.4:attach-descriptor (attach-descriptor) @ hadoop-hdfs-project
---
[INFO] 
[INFO] --- maven-javadoc-plugin:2.8.1:jar (module-javadocs) @ hadoop-hdfs-project ---
[INFO] Not executing Javadoc as the project is not a Java classpath-capable package
[INFO] 
[INFO] --- maven-enforcer-plugin:1.3.1:enforce (depcheck) @ hadoop-hdfs-project ---
[INFO] 
[INFO] --- maven-checkstyle-plugin:2.15:checkstyle (default-cli) @ hadoop-hdfs-project ---
[INFO] 
[INFO] --- findbugs-maven-plugin:3.0.0:findbugs (default-cli) @ hadoop-hdfs-project ---
[INFO] ------------------------------------------------------------------------
[INFO] Reactor Summary:
[INFO] 
[INFO] Apache Hadoop HDFS Client ......................... SUCCESS [03:14 min]
[INFO] Apache Hadoop HDFS ................................ FAILURE [  01:11 h]
[INFO] Apache Hadoop HttpFS .............................. SKIPPED
[INFO] Apache Hadoop HDFS BookKeeper Journal ............. SKIPPED
[INFO] Apache Hadoop HDFS-NFS ............................ SKIPPED
[INFO] Apache Hadoop HDFS Project ........................ SUCCESS [  0.088 s]
[INFO] ------------------------------------------------------------------------
[INFO] BUILD FAILURE
[INFO] ------------------------------------------------------------------------
[INFO] Total time: 01:15 h
[INFO] Finished at: 2015-07-30T12:50:32+00:00
[INFO] Final Memory: 70M/1076M
[INFO] ------------------------------------------------------------------------
[ERROR] Failed to execute goal org.apache.maven.plugins:maven-surefire-plugin:2.17:test (default-test)
on project hadoop-hdfs: ExecutionException: org.apache.maven.surefire.booter.SurefireBooterForkException:
Error occurred in starting fork, check output in log -> [Help 1]
[ERROR] 
[ERROR] To see the full stack trace of the errors, re-run Maven with the -e switch.
[ERROR] Re-run Maven using the -X switch to enable full debug logging.
[ERROR] 
[ERROR] For more information about the errors and possible solutions, please read the following
articles:
[ERROR] [Help 1] http://cwiki.apache.org/confluence/display/MAVEN/MojoFailureException
[ERROR] 
[ERROR] After correcting the problems, you can resume the build with the command
[ERROR]   mvn <goals> -rf :hadoop-hdfs
Build step 'Execute shell' marked build as failure
Archiving artifacts
Sending artifact delta relative to Hadoop-Hdfs-trunk-Java8 #222
Archived 1 artifacts
Archive block size is 32768
Received 0 blocks and 4328075 bytes
Compression is 0.0%
Took 7.1 sec
Recording test results
Updating YARN-2768
Updating HDFS-8816
Updating YARN-3950
Updating HADOOP-10945
Updating YARN-3919

Mime
View raw message