hadoop-hdfs-dev mailing list archives

Site index · List index
Message view « Date » · « Thread »
Top « Date » · « Thread »
From Apache Jenkins Server <jenk...@builds.apache.org>
Subject Hadoop-Hdfs-trunk - Build # 2194 - Still Failing
Date Sat, 25 Jul 2015 14:16:49 GMT
See https://builds.apache.org/job/Hadoop-Hdfs-trunk/2194/

###################################################################################
########################## LAST 60 LINES OF THE CONSOLE ###########################
[...truncated 7340 lines...]
[INFO] 
[INFO] --- maven-checkstyle-plugin:2.15:checkstyle (default-cli) @ hadoop-hdfs-project ---
[INFO] 
[INFO] --- findbugs-maven-plugin:3.0.0:findbugs (default-cli) @ hadoop-hdfs-project ---
[INFO] ------------------------------------------------------------------------
[INFO] Reactor Summary:
[INFO] 
[INFO] Apache Hadoop HDFS Client ......................... SUCCESS [03:08 min]
[INFO] Apache Hadoop HDFS ................................ FAILURE [  02:38 h]
[INFO] Apache Hadoop HttpFS .............................. SKIPPED
[INFO] Apache Hadoop HDFS BookKeeper Journal ............. SKIPPED
[INFO] Apache Hadoop HDFS-NFS ............................ SKIPPED
[INFO] Apache Hadoop HDFS Project ........................ SUCCESS [  0.063 s]
[INFO] ------------------------------------------------------------------------
[INFO] BUILD FAILURE
[INFO] ------------------------------------------------------------------------
[INFO] Total time: 02:42 h
[INFO] Finished at: 2015-07-25T14:16:45+00:00
[INFO] Final Memory: 55M/668M
[INFO] ------------------------------------------------------------------------
[ERROR] Failed to execute goal org.apache.maven.plugins:maven-surefire-plugin:2.17:test (default-test)
on project hadoop-hdfs: There are test failures.
[ERROR] 
[ERROR] Please refer to /home/jenkins/jenkins-slave/workspace/Hadoop-Hdfs-trunk/hadoop-hdfs-project/hadoop-hdfs/target/surefire-reports
for the individual test results.
[ERROR] -> [Help 1]
[ERROR] 
[ERROR] To see the full stack trace of the errors, re-run Maven with the -e switch.
[ERROR] Re-run Maven using the -X switch to enable full debug logging.
[ERROR] 
[ERROR] For more information about the errors and possible solutions, please read the following
articles:
[ERROR] [Help 1] http://cwiki.apache.org/confluence/display/MAVEN/MojoFailureException
[ERROR] 
[ERROR] After correcting the problems, you can resume the build with the command
[ERROR]   mvn <goals> -rf :hadoop-hdfs
Build step 'Execute shell' marked build as failure
Archiving artifacts
Sending artifact delta relative to Hadoop-Hdfs-trunk #2181
Archived 1 artifacts
Archive block size is 32768
Received 0 blocks and 3842436 bytes
Compression is 0.0%
Took 11 sec
Recording test results
Updating YARN-3969
Updating HDFS-8735
Updating HADOOP-12135
Updating YARN-3967
Updating HADOOP-11807
Updating YARN-3925
Updating YARN-1051
Updating YARN-3957
Updating HADOOP-12170
Updating HADOOP-12202
Updating HADOOP-12237
Updating YARN-3026
Updating YARN-3973
Updating HADOOP-12259
Sending e-mails to: hdfs-dev@hadoop.apache.org
Email was triggered for: Failure
Sending email for trigger: Failure



###################################################################################
############################## FAILED TESTS (if any) ##############################
1 tests failed.
FAILED:  org.apache.hadoop.hdfs.TestDistributedFileSystem.testDFSClientPeerWriteTimeout

Error Message:
wrong exception:java.lang.AssertionError: write should timeout

Stack Trace:
java.lang.AssertionError: wrong exception:java.lang.AssertionError: write should timeout
	at org.junit.Assert.fail(Assert.java:88)
	at org.apache.hadoop.hdfs.TestDistributedFileSystem.testDFSClientPeerWriteTimeout(TestDistributedFileSystem.java:1206)



Mime
  • Unnamed multipart/mixed (inline, None, 0 bytes)
View raw message