hadoop-hdfs-dev mailing list archives

Site index · List index
Message view « Date » · « Thread »
Top « Date » · « Thread »
From Apache Jenkins Server <jenk...@builds.apache.org>
Subject Hadoop-Hdfs-trunk-Java8 - Build # 252 - Still Failing
Date Tue, 21 Jul 2015 15:29:47 GMT
See https://builds.apache.org/job/Hadoop-Hdfs-trunk-Java8/252/

###################################################################################
########################## LAST 60 LINES OF THE CONSOLE ###########################
[...truncated 15600 lines...]
[INFO] Not executing Javadoc as the project is not a Java classpath-capable package
[INFO] 
[INFO] --- maven-enforcer-plugin:1.3.1:enforce (depcheck) @ hadoop-hdfs-project ---
[INFO] 
[INFO] --- maven-checkstyle-plugin:2.15:checkstyle (default-cli) @ hadoop-hdfs-project ---
[INFO] 
[INFO] --- findbugs-maven-plugin:3.0.0:findbugs (default-cli) @ hadoop-hdfs-project ---
[INFO] ------------------------------------------------------------------------
[INFO] Reactor Summary:
[INFO] 
[INFO] Apache Hadoop HDFS Client ......................... SUCCESS [03:07 min]
[INFO] Apache Hadoop HDFS ................................ FAILURE [  02:40 h]
[INFO] Apache Hadoop HttpFS .............................. SKIPPED
[INFO] Apache Hadoop HDFS BookKeeper Journal ............. SKIPPED
[INFO] Apache Hadoop HDFS-NFS ............................ SKIPPED
[INFO] Apache Hadoop HDFS Project ........................ SUCCESS [  0.100 s]
[INFO] ------------------------------------------------------------------------
[INFO] BUILD FAILURE
[INFO] ------------------------------------------------------------------------
[INFO] Total time: 02:43 h
[INFO] Finished at: 2015-07-21T15:29:53+00:00
[INFO] Final Memory: 72M/684M
[INFO] ------------------------------------------------------------------------
[ERROR] Failed to execute goal org.apache.maven.plugins:maven-surefire-plugin:2.17:test (default-test)
on project hadoop-hdfs: ExecutionException: java.lang.RuntimeException: The forked VM terminated
without properly saying goodbye. VM crash or System.exit called?
[ERROR] Command was /bin/sh -c cd /home/jenkins/jenkins-slave/workspace/Hadoop-Hdfs-trunk-Java8/hadoop-hdfs-project/hadoop-hdfs
&& /home/jenkins/tools/java/jdk1.8.0/jre/bin/java -Xmx4096m -XX:MaxPermSize=768m -XX:+HeapDumpOnOutOfMemoryError
-jar /home/jenkins/jenkins-slave/workspace/Hadoop-Hdfs-trunk-Java8/hadoop-hdfs-project/hadoop-hdfs/target/surefire/surefirebooter6541768715460778304.jar
/home/jenkins/jenkins-slave/workspace/Hadoop-Hdfs-trunk-Java8/hadoop-hdfs-project/hadoop-hdfs/target/surefire/surefire5645944406539095126tmp
/home/jenkins/jenkins-slave/workspace/Hadoop-Hdfs-trunk-Java8/hadoop-hdfs-project/hadoop-hdfs/target/surefire/surefire_3161869502325653741904tmp
[ERROR] -> [Help 1]
[ERROR] 
[ERROR] To see the full stack trace of the errors, re-run Maven with the -e switch.
[ERROR] Re-run Maven using the -X switch to enable full debug logging.
[ERROR] 
[ERROR] For more information about the errors and possible solutions, please read the following
articles:
[ERROR] [Help 1] http://cwiki.apache.org/confluence/display/MAVEN/MojoFailureException
[ERROR] 
[ERROR] After correcting the problems, you can resume the build with the command
[ERROR]   mvn <goals> -rf :hadoop-hdfs
Build step 'Execute shell' marked build as failure
Archiving artifacts
Sending artifact delta relative to Hadoop-Hdfs-trunk-Java8 #222
Archived 1 artifacts
Archive block size is 32768
Received 0 blocks and 4298347 bytes
Compression is 0.0%
Took 3 sec
Recording test results
Updating HADOOP-12081
Updating HDFS-7483
Updating HDFS-8657
Updating HDFS-8794
Updating HADOOP-12214
Updating HDFS-6945
Updating HADOOP-11893
Updating HADOOP-12088
Updating HADOOP-12051
Updating HDFS-7582
Updating HDFS-8344
Updating HADOOP-12209
Sending e-mails to: hdfs-dev@hadoop.apache.org
Email was triggered for: Failure
Sending email for trigger: Failure



###################################################################################
############################## FAILED TESTS (if any) ##############################
9 tests failed.
FAILED:  org.apache.hadoop.hdfs.server.namenode.ha.TestDNFencing.testQueueingWithAppend

Error Message:
expected:<21> but was:<19>

Stack Trace:
java.lang.AssertionError: expected:<21> but was:<19>
	at org.junit.Assert.fail(Assert.java:88)
	at org.junit.Assert.failNotEquals(Assert.java:743)
	at org.junit.Assert.assertEquals(Assert.java:118)
	at org.junit.Assert.assertEquals(Assert.java:555)
	at org.junit.Assert.assertEquals(Assert.java:542)
	at org.apache.hadoop.hdfs.server.namenode.ha.TestDNFencing.testQueueingWithAppend(TestDNFencing.java:463)


FAILED:  org.apache.hadoop.hdfs.server.namenode.ha.TestRetryCacheWithHA.testRetryCacheOnStandbyNN

Error Message:
org/apache/hadoop/fs/FileContext

Stack Trace:
java.lang.NoClassDefFoundError: org/apache/hadoop/fs/FileContext
	at java.net.URLClassLoader$1.run(URLClassLoader.java:372)
	at java.net.URLClassLoader$1.run(URLClassLoader.java:361)
	at java.security.AccessController.doPrivileged(Native Method)
	at java.net.URLClassLoader.findClass(URLClassLoader.java:360)
	at java.lang.ClassLoader.loadClass(ClassLoader.java:424)
	at sun.misc.Launcher$AppClassLoader.loadClass(Launcher.java:308)
	at java.lang.ClassLoader.loadClass(ClassLoader.java:357)
	at org.apache.hadoop.hdfs.DFSTestUtil.runOperations(DFSTestUtil.java:1244)
	at org.apache.hadoop.hdfs.server.namenode.ha.TestRetryCacheWithHA.testRetryCacheOnStandbyNN(TestRetryCacheWithHA.java:161)


FAILED:  org.apache.hadoop.hdfs.server.namenode.ha.TestRetryCacheWithHA.testRename2

Error Message:
test timed out after 60000 milliseconds

Stack Trace:
java.lang.Exception: test timed out after 60000 milliseconds
	at java.lang.Object.wait(Native Method)
	at java.lang.Object.wait(Object.java:502)
	at org.apache.hadoop.hdfs.server.namenode.ha.TestRetryCacheWithHA.testClientRetryWithFailover(TestRetryCacheWithHA.java:1320)
	at org.apache.hadoop.hdfs.server.namenode.ha.TestRetryCacheWithHA.testRename2(TestRetryCacheWithHA.java:1177)


FAILED:  org.apache.hadoop.hdfs.server.namenode.ha.TestRetryCacheWithHA.testRename2

Error Message:
Test resulted in an unexpected exit

Stack Trace:
java.lang.AssertionError: Test resulted in an unexpected exit
	at org.apache.hadoop.hdfs.MiniDFSCluster.shutdown(MiniDFSCluster.java:1843)
	at org.apache.hadoop.hdfs.MiniDFSCluster.shutdown(MiniDFSCluster.java:1830)
	at org.apache.hadoop.hdfs.MiniDFSCluster.shutdown(MiniDFSCluster.java:1823)
	at org.apache.hadoop.hdfs.server.namenode.ha.TestRetryCacheWithHA.cleanup(TestRetryCacheWithHA.java:149)


FAILED:  org.apache.hadoop.hdfs.server.namenode.ha.TestRetryCacheWithHA.testAppend

Error Message:
test timed out after 60000 milliseconds

Stack Trace:
java.lang.Exception: test timed out after 60000 milliseconds
	at java.lang.Object.wait(Native Method)
	at java.lang.Object.wait(Object.java:502)
	at org.apache.hadoop.hdfs.server.namenode.ha.TestRetryCacheWithHA.testClientRetryWithFailover(TestRetryCacheWithHA.java:1320)
	at org.apache.hadoop.hdfs.server.namenode.ha.TestRetryCacheWithHA.testAppend(TestRetryCacheWithHA.java:1163)


FAILED:  org.apache.hadoop.hdfs.server.namenode.ha.TestRetryCacheWithHA.testDelete

Error Message:
After waiting the operation delete still has not taken effect on NN yet

Stack Trace:
java.lang.AssertionError: After waiting the operation delete still has not taken effect on
NN yet
	at org.junit.Assert.fail(Assert.java:88)
	at org.junit.Assert.assertTrue(Assert.java:41)
	at org.apache.hadoop.hdfs.server.namenode.ha.TestRetryCacheWithHA.testClientRetryWithFailover(TestRetryCacheWithHA.java:1307)
	at org.apache.hadoop.hdfs.server.namenode.ha.TestRetryCacheWithHA.testDelete(TestRetryCacheWithHA.java:1191)


FAILED:  org.apache.hadoop.hdfs.server.namenode.ha.TestRetryCacheWithHA.testRemoveCachePool

Error Message:
test timed out after 60000 milliseconds

Stack Trace:
java.lang.Exception: test timed out after 60000 milliseconds
	at java.lang.Thread.sleep(Native Method)
	at org.apache.hadoop.io.retry.RetryInvocationHandler.invoke(RetryInvocationHandler.java:150)
	at com.sun.proxy.$Proxy22.addCachePool(Unknown Source)
	at org.apache.hadoop.hdfs.DFSClient.addCachePool(DFSClient.java:2450)
	at org.apache.hadoop.hdfs.server.namenode.ha.TestRetryCacheWithHA$RemoveCachePoolOp.prepare(TestRetryCacheWithHA.java:1014)
	at org.apache.hadoop.hdfs.server.namenode.ha.TestRetryCacheWithHA.testClientRetryWithFailover(TestRetryCacheWithHA.java:1283)
	at org.apache.hadoop.hdfs.server.namenode.ha.TestRetryCacheWithHA.testRemoveCachePool(TestRetryCacheWithHA.java:1257)


FAILED:  org.apache.hadoop.hdfs.server.namenode.ha.TestSeveralNameNodes.testCircularLinkedListWrites

Error Message:
Some writers didn't complete in expected runtime! Current writer state:[Circular Writer:
  directory: /test-0
  target length: 50
  current item: 20
  done: false
] expected:<0> but was:<1>

Stack Trace:
java.lang.AssertionError: Some writers didn't complete in expected runtime! Current writer
state:[Circular Writer:
	 directory: /test-0
	 target length: 50
	 current item: 20
	 done: false
] expected:<0> but was:<1>
	at org.junit.Assert.fail(Assert.java:88)
	at org.junit.Assert.failNotEquals(Assert.java:743)
	at org.junit.Assert.assertEquals(Assert.java:118)
	at org.junit.Assert.assertEquals(Assert.java:555)
	at org.apache.hadoop.hdfs.server.namenode.ha.TestSeveralNameNodes.testCircularLinkedListWrites(TestSeveralNameNodes.java:90)


FAILED:  org.apache.hadoop.hdfs.TestDistributedFileSystem.testDFSClientPeerWriteTimeout

Error Message:
wrong exception:java.lang.AssertionError: write should timeout

Stack Trace:
java.lang.AssertionError: wrong exception:java.lang.AssertionError: write should timeout
	at org.junit.Assert.fail(Assert.java:88)
	at org.apache.hadoop.hdfs.TestDistributedFileSystem.testDFSClientPeerWriteTimeout(TestDistributedFileSystem.java:1206)



Mime
  • Unnamed multipart/mixed (inline, None, 0 bytes)
View raw message