hadoop-hdfs-dev mailing list archives

Site index · List index
Message view « Date » · « Thread »
Top « Date » · « Thread »
From Apache Jenkins Server <jenk...@builds.apache.org>
Subject Hadoop-Hdfs-trunk - Build # 2188 - Still Failing
Date Sun, 19 Jul 2015 14:21:57 GMT
See https://builds.apache.org/job/Hadoop-Hdfs-trunk/2188/

###################################################################################
########################## LAST 60 LINES OF THE CONSOLE ###########################
[...truncated 7344 lines...]
[INFO] 
[INFO] --- maven-source-plugin:2.3:jar-no-fork (hadoop-java-sources) @ hadoop-hdfs-project
---
[INFO] 
[INFO] --- maven-source-plugin:2.3:test-jar-no-fork (hadoop-java-sources) @ hadoop-hdfs-project
---
[INFO] 
[INFO] --- maven-enforcer-plugin:1.3.1:enforce (dist-enforce) @ hadoop-hdfs-project ---
[INFO] 
[INFO] --- maven-site-plugin:3.4:attach-descriptor (attach-descriptor) @ hadoop-hdfs-project
---
[INFO] 
[INFO] --- maven-javadoc-plugin:2.8.1:jar (module-javadocs) @ hadoop-hdfs-project ---
[INFO] Skipping javadoc generation
[INFO] 
[INFO] --- maven-enforcer-plugin:1.3.1:enforce (depcheck) @ hadoop-hdfs-project ---
[INFO] 
[INFO] --- maven-checkstyle-plugin:2.15:checkstyle (default-cli) @ hadoop-hdfs-project ---
[INFO] 
[INFO] --- findbugs-maven-plugin:3.0.0:findbugs (default-cli) @ hadoop-hdfs-project ---
[INFO] ------------------------------------------------------------------------
[INFO] Reactor Summary:
[INFO] 
[INFO] Apache Hadoop HDFS Client ......................... SUCCESS [03:25 min]
[INFO] Apache Hadoop HDFS ................................ FAILURE [  02:42 h]
[INFO] Apache Hadoop HttpFS .............................. SKIPPED
[INFO] Apache Hadoop HDFS BookKeeper Journal ............. SKIPPED
[INFO] Apache Hadoop HDFS-NFS ............................ SKIPPED
[INFO] Apache Hadoop HDFS Project ........................ SUCCESS [  0.066 s]
[INFO] ------------------------------------------------------------------------
[INFO] BUILD FAILURE
[INFO] ------------------------------------------------------------------------
[INFO] Total time: 02:46 h
[INFO] Finished at: 2015-07-19T14:20:51+00:00
[INFO] Final Memory: 54M/831M
[INFO] ------------------------------------------------------------------------
[ERROR] Failed to execute goal org.apache.maven.plugins:maven-surefire-plugin:2.17:test (default-test)
on project hadoop-hdfs: There are test failures.
[ERROR] 
[ERROR] Please refer to /home/jenkins/jenkins-slave/workspace/Hadoop-Hdfs-trunk/hadoop-hdfs-project/hadoop-hdfs/target/surefire-reports
for the individual test results.
[ERROR] -> [Help 1]
[ERROR] 
[ERROR] To see the full stack trace of the errors, re-run Maven with the -e switch.
[ERROR] Re-run Maven using the -X switch to enable full debug logging.
[ERROR] 
[ERROR] For more information about the errors and possible solutions, please read the following
articles:
[ERROR] [Help 1] http://cwiki.apache.org/confluence/display/MAVEN/MojoFailureException
[ERROR] 
[ERROR] After correcting the problems, you can resume the build with the command
[ERROR]   mvn <goals> -rf :hadoop-hdfs
Build step 'Execute shell' marked build as failure
Archiving artifacts
Sending artifact delta relative to Hadoop-Hdfs-trunk #2181
Archived 1 artifacts
Archive block size is 32768
Received 0 blocks and 3836785 bytes
Compression is 0.0%
Took 10 sec
Recording test results
Updating YARN-3535
Sending e-mails to: hdfs-dev@hadoop.apache.org
Email was triggered for: Failure
Sending email for trigger: Failure



###################################################################################
############################## FAILED TESTS (if any) ##############################
2 tests failed.
FAILED:  org.apache.hadoop.hdfs.TestAppendSnapshotTruncate.testAST

Error Message:
dir has ERROR

Stack Trace:
java.lang.IllegalStateException: dir has ERROR
	at org.apache.hadoop.hdfs.TestAppendSnapshotTruncate$Worker.checkErrorState(TestAppendSnapshotTruncate.java:430)
	at org.apache.hadoop.hdfs.TestAppendSnapshotTruncate$Worker.stop(TestAppendSnapshotTruncate.java:483)
	at org.apache.hadoop.hdfs.TestAppendSnapshotTruncate.testAST(TestAppendSnapshotTruncate.java:128)
Caused by: java.lang.IllegalStateException: null
	at com.google.common.base.Preconditions.checkState(Preconditions.java:129)
	at org.apache.hadoop.hdfs.TestAppendSnapshotTruncate$Worker.pause(TestAppendSnapshotTruncate.java:479)
	at org.apache.hadoop.hdfs.TestAppendSnapshotTruncate$DirWorker.pauseAllFiles(TestAppendSnapshotTruncate.java:247)
	at org.apache.hadoop.hdfs.TestAppendSnapshotTruncate$DirWorker.call(TestAppendSnapshotTruncate.java:220)
	at org.apache.hadoop.hdfs.TestAppendSnapshotTruncate$DirWorker.call(TestAppendSnapshotTruncate.java:140)
	at org.apache.hadoop.hdfs.TestAppendSnapshotTruncate$Worker$1.run(TestAppendSnapshotTruncate.java:454)
	at java.lang.Thread.run(Thread.java:745)


FAILED:  org.apache.hadoop.hdfs.TestDistributedFileSystem.testDFSClientPeerWriteTimeout

Error Message:
wrong exception:java.lang.AssertionError: write should timeout

Stack Trace:
java.lang.AssertionError: wrong exception:java.lang.AssertionError: write should timeout
	at org.junit.Assert.fail(Assert.java:88)
	at org.apache.hadoop.hdfs.TestDistributedFileSystem.testDFSClientPeerWriteTimeout(TestDistributedFileSystem.java:1206)



Mime
  • Unnamed multipart/mixed (inline, None, 0 bytes)
View raw message