hadoop-hdfs-dev mailing list archives

Site index · List index
Message view « Date » · « Thread »
Top « Date » · « Thread »
From Apache Jenkins Server <jenk...@builds.apache.org>
Subject Hadoop-Hdfs-trunk - Build # 2177 - Still Failing
Date Wed, 08 Jul 2015 14:14:01 GMT
See https://builds.apache.org/job/Hadoop-Hdfs-trunk/2177/

###################################################################################
########################## LAST 60 LINES OF THE CONSOLE ###########################
[...truncated 7362 lines...]
[INFO] --- maven-enforcer-plugin:1.3.1:enforce (depcheck) @ hadoop-hdfs-project ---
[INFO] 
[INFO] --- maven-checkstyle-plugin:2.15:checkstyle (default-cli) @ hadoop-hdfs-project ---
[INFO] 
[INFO] --- findbugs-maven-plugin:3.0.0:findbugs (default-cli) @ hadoop-hdfs-project ---
[INFO] ------------------------------------------------------------------------
[INFO] Reactor Summary:
[INFO] 
[INFO] Apache Hadoop HDFS Client ......................... SUCCESS [ 48.691 s]
[INFO] Apache Hadoop HDFS ................................ FAILURE [  02:38 h]
[INFO] Apache Hadoop HttpFS .............................. SKIPPED
[INFO] Apache Hadoop HDFS BookKeeper Journal ............. SKIPPED
[INFO] Apache Hadoop HDFS-NFS ............................ SKIPPED
[INFO] Apache Hadoop HDFS Project ........................ SUCCESS [  0.077 s]
[INFO] ------------------------------------------------------------------------
[INFO] BUILD FAILURE
[INFO] ------------------------------------------------------------------------
[INFO] Total time: 02:39 h
[INFO] Finished at: 2015-07-08T14:13:52+00:00
[INFO] Final Memory: 61M/680M
[INFO] ------------------------------------------------------------------------
[ERROR] Failed to execute goal org.apache.maven.plugins:maven-surefire-plugin:2.17:test (default-test)
on project hadoop-hdfs: There are test failures.
[ERROR] 
[ERROR] Please refer to /home/jenkins/jenkins-slave/workspace/Hadoop-Hdfs-trunk/hadoop-hdfs-project/hadoop-hdfs/target/surefire-reports
for the individual test results.
[ERROR] -> [Help 1]
[ERROR] 
[ERROR] To see the full stack trace of the errors, re-run Maven with the -e switch.
[ERROR] Re-run Maven using the -X switch to enable full debug logging.
[ERROR] 
[ERROR] For more information about the errors and possible solutions, please read the following
articles:
[ERROR] [Help 1] http://cwiki.apache.org/confluence/display/MAVEN/MojoFailureException
[ERROR] 
[ERROR] After correcting the problems, you can resume the build with the command
[ERROR]   mvn <goals> -rf :hadoop-hdfs
Build step 'Execute shell' marked build as failure
Archiving artifacts
Sending artifact delta relative to Hadoop-Hdfs-trunk #2173
Archived 1 artifacts
Archive block size is 32768
Received 0 blocks and 380493 bytes
Compression is 0.0%
Took 1.2 sec
Recording test results
Updating YARN-3892
Updating YARN-2194
Updating HADOOP-5732
Updating MAPREDUCE-6038
Updating HDFS-8652
Updating YARN-3690
Updating HDFS-8620
Updating HADOOP-12195
Updating HADOOP-12186
Updating HDFS-8712
Updating HDFS-8711
Updating HADOOP-12193
Updating MCOMPILER-205
Sending e-mails to: hdfs-dev@hadoop.apache.org
Email was triggered for: Failure
Sending email for trigger: Failure



###################################################################################
############################## FAILED TESTS (if any) ##############################
2 tests failed.
REGRESSION:  org.apache.hadoop.hdfs.server.namenode.TestNameEditsConfigs.testNameEditsConfigs

Error Message:
Read timed out

Stack Trace:
java.net.SocketTimeoutException: Read timed out
	at java.net.SocketInputStream.socketRead0(Native Method)
	at java.net.SocketInputStream.read(SocketInputStream.java:152)
	at java.net.SocketInputStream.read(SocketInputStream.java:122)
	at java.io.BufferedInputStream.fill(BufferedInputStream.java:235)
	at java.io.BufferedInputStream.read1(BufferedInputStream.java:275)
	at java.io.BufferedInputStream.read(BufferedInputStream.java:334)
	at sun.net.www.http.HttpClient.parseHTTPHeader(HttpClient.java:687)
	at sun.net.www.http.HttpClient.parseHTTP(HttpClient.java:633)
	at sun.net.www.protocol.http.HttpURLConnection.getInputStream(HttpURLConnection.java:1323)
	at java.net.HttpURLConnection.getResponseCode(HttpURLConnection.java:468)
	at org.apache.hadoop.hdfs.server.namenode.TransferFsImage.doGetUrl(TransferFsImage.java:437)
	at org.apache.hadoop.hdfs.server.namenode.TransferFsImage.getFileClient(TransferFsImage.java:422)
	at org.apache.hadoop.hdfs.server.namenode.TransferFsImage.downloadImageToStorage(TransferFsImage.java:142)
	at org.apache.hadoop.hdfs.server.namenode.SecondaryNameNode$2.run(SecondaryNameNode.java:460)
	at org.apache.hadoop.hdfs.server.namenode.SecondaryNameNode$2.run(SecondaryNameNode.java:448)
	at java.security.AccessController.doPrivileged(Native Method)
	at javax.security.auth.Subject.doAs(Subject.java:415)
	at org.apache.hadoop.security.UserGroupInformation.doAs(UserGroupInformation.java:1666)
	at org.apache.hadoop.hdfs.server.namenode.SecondaryNameNode.downloadCheckpointFiles(SecondaryNameNode.java:447)
	at org.apache.hadoop.hdfs.server.namenode.SecondaryNameNode.doCheckpoint(SecondaryNameNode.java:544)
	at org.apache.hadoop.hdfs.server.namenode.TestNameEditsConfigs.testNameEditsConfigs(TestNameEditsConfigs.java:255)


REGRESSION:  org.apache.hadoop.hdfs.server.namenode.ha.TestPipelinesFailover.testFailoverRightBeforeCommitSynchronization

Error Message:
Cannot obtain block length for LocatedBlock{BP-496163270-67.195.81.148-1436360556178:blk_1073741825_1001;
getBlockSize()=2048; corrupt=false; offset=0; locs=[DatanodeInfoWithStorage[127.0.0.1:58321,DS-0c93859a-811e-40f9-b55c-abc9e580a863,DISK],
DatanodeInfoWithStorage[127.0.0.1:32869,DS-a95e3126-f8a1-439d-8b07-239f309fcbbf,DISK], DatanodeInfoWithStorage[127.0.0.1:41541,DS-a06114db-eb43-467f-95c2-8eb06e0c9fef,DISK]]}

Stack Trace:
java.io.IOException: Cannot obtain block length for LocatedBlock{BP-496163270-67.195.81.148-1436360556178:blk_1073741825_1001;
getBlockSize()=2048; corrupt=false; offset=0; locs=[DatanodeInfoWithStorage[127.0.0.1:58321,DS-0c93859a-811e-40f9-b55c-abc9e580a863,DISK],
DatanodeInfoWithStorage[127.0.0.1:32869,DS-a95e3126-f8a1-439d-8b07-239f309fcbbf,DISK], DatanodeInfoWithStorage[127.0.0.1:41541,DS-a06114db-eb43-467f-95c2-8eb06e0c9fef,DISK]]}
	at org.apache.hadoop.hdfs.DFSInputStream.readBlockLength(DFSInputStream.java:404)
	at org.apache.hadoop.hdfs.DFSInputStream.fetchLocatedBlocksAndGetLastBlockLength(DFSInputStream.java:346)
	at org.apache.hadoop.hdfs.DFSInputStream.openInfo(DFSInputStream.java:276)
	at org.apache.hadoop.hdfs.DFSInputStream.<init>(DFSInputStream.java:265)
	at org.apache.hadoop.hdfs.DFSClient.open(DFSClient.java:1184)
	at org.apache.hadoop.hdfs.DistributedFileSystem$3.doCall(DistributedFileSystem.java:308)
	at org.apache.hadoop.hdfs.DistributedFileSystem$3.doCall(DistributedFileSystem.java:304)
	at org.apache.hadoop.fs.FileSystemLinkResolver.resolve(FileSystemLinkResolver.java:81)
	at org.apache.hadoop.hdfs.DistributedFileSystem.open(DistributedFileSystem.java:304)
	at org.apache.hadoop.fs.FileSystem.open(FileSystem.java:768)
	at org.apache.hadoop.hdfs.DFSTestUtil.getFirstBlock(DFSTestUtil.java:772)
	at org.apache.hadoop.hdfs.server.namenode.ha.TestPipelinesFailover.testFailoverRightBeforeCommitSynchronization(TestPipelinesFailover.java:350)



Mime
  • Unnamed multipart/mixed (inline, None, 0 bytes)
View raw message