hadoop-hdfs-dev mailing list archives

Site index · List index
Message view « Date » · « Thread »
Top « Date » · « Thread »
From Apache Jenkins Server <jenk...@builds.apache.org>
Subject Hadoop-Hdfs-trunk-Java8 - Build # 229 - Still Failing
Date Fri, 26 Jun 2015 14:27:37 GMT
See https://builds.apache.org/job/Hadoop-Hdfs-trunk-Java8/229/

###################################################################################
########################## LAST 60 LINES OF THE CONSOLE ###########################
[...truncated 7442 lines...]
[INFO] --- maven-enforcer-plugin:1.3.1:enforce (dist-enforce) @ hadoop-hdfs-project ---
[INFO] 
[INFO] --- maven-site-plugin:3.4:attach-descriptor (attach-descriptor) @ hadoop-hdfs-project
---
[INFO] 
[INFO] --- maven-javadoc-plugin:2.8.1:jar (module-javadocs) @ hadoop-hdfs-project ---
[INFO] Not executing Javadoc as the project is not a Java classpath-capable package
[INFO] 
[INFO] --- maven-enforcer-plugin:1.3.1:enforce (depcheck) @ hadoop-hdfs-project ---
[INFO] 
[INFO] --- maven-checkstyle-plugin:2.15:checkstyle (default-cli) @ hadoop-hdfs-project ---
[INFO] 
[INFO] --- findbugs-maven-plugin:3.0.0:findbugs (default-cli) @ hadoop-hdfs-project ---
[INFO] ------------------------------------------------------------------------
[INFO] Reactor Summary:
[INFO] 
[INFO] Apache Hadoop HDFS Client ......................... SUCCESS [ 56.400 s]
[INFO] Apache Hadoop HDFS ................................ FAILURE [  02:50 h]
[INFO] Apache Hadoop HttpFS .............................. SKIPPED
[INFO] Apache Hadoop HDFS BookKeeper Journal ............. SKIPPED
[INFO] Apache Hadoop HDFS-NFS ............................ SKIPPED
[INFO] Apache Hadoop HDFS Project ........................ SUCCESS [  0.072 s]
[INFO] ------------------------------------------------------------------------
[INFO] BUILD FAILURE
[INFO] ------------------------------------------------------------------------
[INFO] Total time: 02:51 h
[INFO] Finished at: 2015-06-26T14:26:50+00:00
[INFO] Final Memory: 52M/233M
[INFO] ------------------------------------------------------------------------
[ERROR] Failed to execute goal org.apache.maven.plugins:maven-surefire-plugin:2.17:test (default-test)
on project hadoop-hdfs: There are test failures.
[ERROR] 
[ERROR] Please refer to /home/jenkins/jenkins-slave/workspace/Hadoop-Hdfs-trunk-Java8/hadoop-hdfs-project/hadoop-hdfs/target/surefire-reports
for the individual test results.
[ERROR] -> [Help 1]
[ERROR] 
[ERROR] To see the full stack trace of the errors, re-run Maven with the -e switch.
[ERROR] Re-run Maven using the -X switch to enable full debug logging.
[ERROR] 
[ERROR] For more information about the errors and possible solutions, please read the following
articles:
[ERROR] [Help 1] http://cwiki.apache.org/confluence/display/MAVEN/MojoFailureException
[ERROR] 
[ERROR] After correcting the problems, you can resume the build with the command
[ERROR]   mvn <goals> -rf :hadoop-hdfs
Build step 'Execute shell' marked build as failure
Archiving artifacts
Sending artifact delta relative to Hadoop-Hdfs-trunk-Java8 #222
Archived 1 artifacts
Archive block size is 32768
Received 0 blocks and 826296 bytes
Compression is 0.0%
Took 32 sec
Recording test results
Updating HADOOP-11203
Updating MAPREDUCE-6413
Updating HDFS-8665
Updating HDFS-8462
Updating HDFS-8640
Updating HDFS-8546
Sending e-mails to: hdfs-dev@hadoop.apache.org
Email was triggered for: Failure
Sending email for trigger: Failure



###################################################################################
############################## FAILED TESTS (if any) ##############################
3 tests failed.
REGRESSION:  org.apache.hadoop.hdfs.TestAppendSnapshotTruncate.testAST

Error Message:
dir has ERROR

Stack Trace:
java.lang.IllegalStateException: dir has ERROR
	at org.apache.hadoop.hdfs.TestAppendSnapshotTruncate$Worker.checkErrorState(TestAppendSnapshotTruncate.java:430)
	at org.apache.hadoop.hdfs.TestAppendSnapshotTruncate$Worker.stop(TestAppendSnapshotTruncate.java:483)
	at org.apache.hadoop.hdfs.TestAppendSnapshotTruncate.testAST(TestAppendSnapshotTruncate.java:128)
Caused by: java.lang.IllegalStateException: null
	at com.google.common.base.Preconditions.checkState(Preconditions.java:129)
	at org.apache.hadoop.hdfs.TestAppendSnapshotTruncate$Worker.pause(TestAppendSnapshotTruncate.java:479)
	at org.apache.hadoop.hdfs.TestAppendSnapshotTruncate$DirWorker.pauseAllFiles(TestAppendSnapshotTruncate.java:247)
	at org.apache.hadoop.hdfs.TestAppendSnapshotTruncate$DirWorker.call(TestAppendSnapshotTruncate.java:220)
	at org.apache.hadoop.hdfs.TestAppendSnapshotTruncate$DirWorker.call(TestAppendSnapshotTruncate.java:140)
	at org.apache.hadoop.hdfs.TestAppendSnapshotTruncate$Worker$1.run(TestAppendSnapshotTruncate.java:454)
	at java.lang.Thread.run(Thread.java:744)


FAILED:  org.apache.hadoop.hdfs.server.balancer.TestBalancerWithMultipleNameNodes.testBalancer

Error Message:
File /tmp.txt could only be replicated to 0 nodes instead of minReplication (=1).  There are
1 datanode(s) running and 1 node(s) are excluded in this operation.
 at org.apache.hadoop.hdfs.server.blockmanagement.BlockManager.chooseTarget4NewBlock(BlockManager.java:1571)
 at org.apache.hadoop.hdfs.server.namenode.FSDirWriteFileOp.chooseTargetForNewBlock(FSDirWriteFileOp.java:281)
 at org.apache.hadoop.hdfs.server.namenode.FSNamesystem.getAdditionalBlock(FSNamesystem.java:2770)
 at org.apache.hadoop.hdfs.server.namenode.NameNodeRpcServer.addBlock(NameNodeRpcServer.java:719)
 at org.apache.hadoop.hdfs.protocolPB.ClientNamenodeProtocolServerSideTranslatorPB.addBlock(ClientNamenodeProtocolServerSideTranslatorPB.java:489)
 at org.apache.hadoop.hdfs.protocol.proto.ClientNamenodeProtocolProtos$ClientNamenodeProtocol$2.callBlockingMethod(ClientNamenodeProtocolProtos.java)
 at org.apache.hadoop.ipc.ProtobufRpcEngine$Server$ProtoBufRpcInvoker.call(ProtobufRpcEngine.java:636)
 at org.apache.hadoop.ipc.RPC$Server.call(RPC.java:976)
 at org.apache.hadoop.ipc.Server$Handler$1.run(Server.java:2172)
 at org.apache.hadoop.ipc.Server$Handler$1.run(Server.java:2168)
 at java.security.AccessController.doPrivileged(Native Method)
 at javax.security.auth.Subject.doAs(Subject.java:422)
 at org.apache.hadoop.security.UserGroupInformation.doAs(UserGroupInformation.java:1666)
 at org.apache.hadoop.ipc.Server$Handler.run(Server.java:2168)


Stack Trace:
org.apache.hadoop.ipc.RemoteException: File /tmp.txt could only be replicated to 0 nodes instead
of minReplication (=1).  There are 1 datanode(s) running and 1 node(s) are excluded in this
operation.
	at org.apache.hadoop.hdfs.server.blockmanagement.BlockManager.chooseTarget4NewBlock(BlockManager.java:1571)
	at org.apache.hadoop.hdfs.server.namenode.FSDirWriteFileOp.chooseTargetForNewBlock(FSDirWriteFileOp.java:281)
	at org.apache.hadoop.hdfs.server.namenode.FSNamesystem.getAdditionalBlock(FSNamesystem.java:2770)
	at org.apache.hadoop.hdfs.server.namenode.NameNodeRpcServer.addBlock(NameNodeRpcServer.java:719)
	at org.apache.hadoop.hdfs.protocolPB.ClientNamenodeProtocolServerSideTranslatorPB.addBlock(ClientNamenodeProtocolServerSideTranslatorPB.java:489)
	at org.apache.hadoop.hdfs.protocol.proto.ClientNamenodeProtocolProtos$ClientNamenodeProtocol$2.callBlockingMethod(ClientNamenodeProtocolProtos.java)
	at org.apache.hadoop.ipc.ProtobufRpcEngine$Server$ProtoBufRpcInvoker.call(ProtobufRpcEngine.java:636)
	at org.apache.hadoop.ipc.RPC$Server.call(RPC.java:976)
	at org.apache.hadoop.ipc.Server$Handler$1.run(Server.java:2172)
	at org.apache.hadoop.ipc.Server$Handler$1.run(Server.java:2168)
	at java.security.AccessController.doPrivileged(Native Method)
	at javax.security.auth.Subject.doAs(Subject.java:422)
	at org.apache.hadoop.security.UserGroupInformation.doAs(UserGroupInformation.java:1666)
	at org.apache.hadoop.ipc.Server$Handler.run(Server.java:2168)

	at org.apache.hadoop.ipc.Client.call(Client.java:1440)
	at org.apache.hadoop.ipc.Client.call(Client.java:1371)
	at org.apache.hadoop.ipc.ProtobufRpcEngine$Invoker.invoke(ProtobufRpcEngine.java:229)
	at com.sun.proxy.$Proxy18.addBlock(Unknown Source)
	at org.apache.hadoop.hdfs.protocolPB.ClientNamenodeProtocolTranslatorPB.addBlock(ClientNamenodeProtocolTranslatorPB.java:418)
	at sun.reflect.NativeMethodAccessorImpl.invoke0(Native Method)
	at sun.reflect.NativeMethodAccessorImpl.invoke(NativeMethodAccessorImpl.java:62)
	at sun.reflect.DelegatingMethodAccessorImpl.invoke(DelegatingMethodAccessorImpl.java:43)
	at java.lang.reflect.Method.invoke(Method.java:483)
	at org.apache.hadoop.io.retry.RetryInvocationHandler.invokeMethod(RetryInvocationHandler.java:186)
	at org.apache.hadoop.io.retry.RetryInvocationHandler.invoke(RetryInvocationHandler.java:101)
	at com.sun.proxy.$Proxy19.addBlock(Unknown Source)
	at org.apache.hadoop.hdfs.DataStreamer.locateFollowingBlock(DataStreamer.java:1635)
	at org.apache.hadoop.hdfs.DataStreamer.nextBlockOutputStream(DataStreamer.java:1436)
	at org.apache.hadoop.hdfs.DataStreamer.run(DataStreamer.java:579)


FAILED:  org.apache.hadoop.hdfs.server.namenode.ha.TestSeveralNameNodes.testCircularLinkedListWrites

Error Message:
Some writers didn't complete in expected runtime! Current writer state:[Circular Writer:
  directory: /test-0
  target length: 50
  current item: 21
  done: false
, Circular Writer:
  directory: /test-1
  target length: 50
  current item: 20
  done: false
, Circular Writer:
  directory: /test-2
  target length: 50
  current item: 17
  done: false
] expected:<0> but was:<3>

Stack Trace:
java.lang.AssertionError: Some writers didn't complete in expected runtime! Current writer
state:[Circular Writer:
	 directory: /test-0
	 target length: 50
	 current item: 21
	 done: false
, Circular Writer:
	 directory: /test-1
	 target length: 50
	 current item: 20
	 done: false
, Circular Writer:
	 directory: /test-2
	 target length: 50
	 current item: 17
	 done: false
] expected:<0> but was:<3>
	at org.junit.Assert.fail(Assert.java:88)
	at org.junit.Assert.failNotEquals(Assert.java:743)
	at org.junit.Assert.assertEquals(Assert.java:118)
	at org.junit.Assert.assertEquals(Assert.java:555)
	at org.apache.hadoop.hdfs.server.namenode.ha.TestSeveralNameNodes.testCircularLinkedListWrites(TestSeveralNameNodes.java:90)



Mime
  • Unnamed multipart/mixed (inline, None, 0 bytes)
View raw message