hadoop-hdfs-dev mailing list archives

Site index · List index
Message view « Date » · « Thread »
Top « Date » · « Thread »
From Apache Jenkins Server <jenk...@builds.apache.org>
Subject Hadoop-Hdfs-trunk - Build # 2171 - Failure
Date Mon, 29 Jun 2015 14:26:20 GMT
See https://builds.apache.org/job/Hadoop-Hdfs-trunk/2171/

###################################################################################
########################## LAST 60 LINES OF THE CONSOLE ###########################
[...truncated 6911 lines...]
[INFO] --- maven-enforcer-plugin:1.3.1:enforce (dist-enforce) @ hadoop-hdfs-project ---
[INFO] 
[INFO] --- maven-site-plugin:3.4:attach-descriptor (attach-descriptor) @ hadoop-hdfs-project
---
[INFO] 
[INFO] --- maven-javadoc-plugin:2.8.1:jar (module-javadocs) @ hadoop-hdfs-project ---
[INFO] Skipping javadoc generation
[INFO] 
[INFO] --- maven-enforcer-plugin:1.3.1:enforce (depcheck) @ hadoop-hdfs-project ---
[INFO] 
[INFO] --- maven-checkstyle-plugin:2.15:checkstyle (default-cli) @ hadoop-hdfs-project ---
[INFO] 
[INFO] --- findbugs-maven-plugin:3.0.0:findbugs (default-cli) @ hadoop-hdfs-project ---
[INFO] ------------------------------------------------------------------------
[INFO] Reactor Summary:
[INFO] 
[INFO] Apache Hadoop HDFS Client ......................... SUCCESS [ 46.503 s]
[INFO] Apache Hadoop HDFS ................................ FAILURE [  02:41 h]
[INFO] Apache Hadoop HttpFS .............................. SKIPPED
[INFO] Apache Hadoop HDFS BookKeeper Journal ............. SKIPPED
[INFO] Apache Hadoop HDFS-NFS ............................ SKIPPED
[INFO] Apache Hadoop HDFS Project ........................ SUCCESS [  0.065 s]
[INFO] ------------------------------------------------------------------------
[INFO] BUILD FAILURE
[INFO] ------------------------------------------------------------------------
[INFO] Total time: 02:42 h
[INFO] Finished at: 2015-06-29T14:25:58+00:00
[INFO] Final Memory: 63M/665M
[INFO] ------------------------------------------------------------------------
[ERROR] Failed to execute goal org.apache.maven.plugins:maven-surefire-plugin:2.17:test (default-test)
on project hadoop-hdfs: There are test failures.
[ERROR] 
[ERROR] Please refer to /home/jenkins/jenkins-slave/workspace/Hadoop-Hdfs-trunk/hadoop-hdfs-project/hadoop-hdfs/target/surefire-reports
for the individual test results.
[ERROR] -> [Help 1]
[ERROR] 
[ERROR] To see the full stack trace of the errors, re-run Maven with the -e switch.
[ERROR] Re-run Maven using the -X switch to enable full debug logging.
[ERROR] 
[ERROR] For more information about the errors and possible solutions, please read the following
articles:
[ERROR] [Help 1] http://cwiki.apache.org/confluence/display/MAVEN/MojoFailureException
[ERROR] 
[ERROR] After correcting the problems, you can resume the build with the command
[ERROR]   mvn <goals> -rf :hadoop-hdfs
Build step 'Execute shell' marked build as failure
Archiving artifacts
Sending artifact delta relative to Hadoop-Hdfs-trunk #2170
Archived 1 artifacts
Archive block size is 32768
Received 0 blocks and 381367 bytes
Compression is 0.0%
Took 8.9 sec
Recording test results
Updating HDFS-8628
Updating HADOOP-12009
Updating YARN-3860
Updating HDFS-8586
Updating HDFS-8681
Updating HADOOP-12119
Sending e-mails to: hdfs-dev@hadoop.apache.org
Email was triggered for: Failure
Sending email for trigger: Failure



###################################################################################
############################## FAILED TESTS (if any) ##############################
5 tests failed.
REGRESSION:  org.apache.hadoop.hdfs.TestAppendSnapshotTruncate.testAST

Error Message:
dir has ERROR

Stack Trace:
java.lang.IllegalStateException: dir has ERROR
	at org.apache.hadoop.hdfs.TestAppendSnapshotTruncate$Worker.checkErrorState(TestAppendSnapshotTruncate.java:430)
	at org.apache.hadoop.hdfs.TestAppendSnapshotTruncate$Worker.stop(TestAppendSnapshotTruncate.java:483)
	at org.apache.hadoop.hdfs.TestAppendSnapshotTruncate.testAST(TestAppendSnapshotTruncate.java:128)
Caused by: java.lang.IllegalStateException: null
	at com.google.common.base.Preconditions.checkState(Preconditions.java:129)
	at org.apache.hadoop.hdfs.TestAppendSnapshotTruncate$Worker.pause(TestAppendSnapshotTruncate.java:479)
	at org.apache.hadoop.hdfs.TestAppendSnapshotTruncate$DirWorker.pauseAllFiles(TestAppendSnapshotTruncate.java:247)
	at org.apache.hadoop.hdfs.TestAppendSnapshotTruncate$DirWorker.call(TestAppendSnapshotTruncate.java:220)
	at org.apache.hadoop.hdfs.TestAppendSnapshotTruncate$DirWorker.call(TestAppendSnapshotTruncate.java:140)
	at org.apache.hadoop.hdfs.TestAppendSnapshotTruncate$Worker$1.run(TestAppendSnapshotTruncate.java:454)
	at java.lang.Thread.run(Thread.java:745)


REGRESSION:  org.apache.hadoop.hdfs.TestHDFSFileSystemContract.testListStatus

Error Message:
null

Stack Trace:
junit.framework.AssertionFailedError: null
	at junit.framework.Assert.fail(Assert.java:55)
	at junit.framework.Assert.assertTrue(Assert.java:22)
	at junit.framework.Assert.assertTrue(Assert.java:31)
	at junit.framework.TestCase.assertTrue(TestCase.java:201)
	at org.apache.hadoop.fs.FileSystemContractBaseTest.testListStatus(FileSystemContractBaseTest.java:232)
	at sun.reflect.NativeMethodAccessorImpl.invoke0(Native Method)
	at sun.reflect.NativeMethodAccessorImpl.invoke(NativeMethodAccessorImpl.java:57)
	at sun.reflect.DelegatingMethodAccessorImpl.invoke(DelegatingMethodAccessorImpl.java:43)
	at java.lang.reflect.Method.invoke(Method.java:606)
	at junit.framework.TestCase.runTest(TestCase.java:176)
	at junit.framework.TestCase.runBare(TestCase.java:141)
	at junit.framework.TestResult$1.protect(TestResult.java:122)
	at junit.framework.TestResult.runProtected(TestResult.java:142)
	at junit.framework.TestResult.run(TestResult.java:125)
	at junit.framework.TestCase.run(TestCase.java:129)
	at junit.framework.TestSuite.runTest(TestSuite.java:255)
	at junit.framework.TestSuite.run(TestSuite.java:250)
	at org.junit.internal.runners.JUnit38ClassRunner.run(JUnit38ClassRunner.java:84)
	at org.apache.maven.surefire.junit4.JUnit4Provider.execute(JUnit4Provider.java:264)
	at org.apache.maven.surefire.junit4.JUnit4Provider.executeTestSet(JUnit4Provider.java:153)
	at org.apache.maven.surefire.junit4.JUnit4Provider.invoke(JUnit4Provider.java:124)
	at org.apache.maven.surefire.booter.ForkedBooter.invokeProviderInSameClassLoader(ForkedBooter.java:200)
	at org.apache.maven.surefire.booter.ForkedBooter.runSuitesInProcess(ForkedBooter.java:153)
	at org.apache.maven.surefire.booter.ForkedBooter.main(ForkedBooter.java:103)


REGRESSION:  org.apache.hadoop.hdfs.server.namenode.ha.TestDFSUpgradeWithHA.testRollbackWithNfs

Error Message:
Port in use: localhost:39362

Stack Trace:
java.net.BindException: Port in use: localhost:39362
	at sun.nio.ch.Net.bind0(Native Method)
	at sun.nio.ch.Net.bind(Net.java:444)
	at sun.nio.ch.Net.bind(Net.java:436)
	at sun.nio.ch.ServerSocketChannelImpl.bind(ServerSocketChannelImpl.java:214)
	at sun.nio.ch.ServerSocketAdaptor.bind(ServerSocketAdaptor.java:74)
	at org.mortbay.jetty.nio.SelectChannelConnector.open(SelectChannelConnector.java:216)
	at org.apache.hadoop.http.HttpServer2.openListeners(HttpServer2.java:882)
	at org.apache.hadoop.http.HttpServer2.start(HttpServer2.java:824)
	at org.apache.hadoop.hdfs.server.namenode.NameNodeHttpServer.start(NameNodeHttpServer.java:142)
	at org.apache.hadoop.hdfs.server.namenode.NameNode.startHttpServer(NameNode.java:752)
	at org.apache.hadoop.hdfs.server.namenode.NameNode.initialize(NameNode.java:638)
	at org.apache.hadoop.hdfs.server.namenode.NameNode.<init>(NameNode.java:809)
	at org.apache.hadoop.hdfs.server.namenode.NameNode.<init>(NameNode.java:793)
	at org.apache.hadoop.hdfs.server.namenode.NameNode.createNameNode(NameNode.java:1482)
	at org.apache.hadoop.hdfs.MiniDFSCluster.restartNameNode(MiniDFSCluster.java:1964)
	at org.apache.hadoop.hdfs.MiniDFSCluster.restartNameNode(MiniDFSCluster.java:1945)
	at org.apache.hadoop.hdfs.server.namenode.ha.TestDFSUpgradeWithHA.testRollbackWithNfs(TestDFSUpgradeWithHA.java:593)


REGRESSION:  org.apache.hadoop.hdfs.server.namenode.ha.TestStandbyIsHot.testDatanodeRestarts

Error Message:
expected:<0> but was:<4>

Stack Trace:
java.lang.AssertionError: expected:<0> but was:<4>
	at org.junit.Assert.fail(Assert.java:88)
	at org.junit.Assert.failNotEquals(Assert.java:743)
	at org.junit.Assert.assertEquals(Assert.java:118)
	at org.junit.Assert.assertEquals(Assert.java:555)
	at org.junit.Assert.assertEquals(Assert.java:542)
	at org.apache.hadoop.hdfs.server.namenode.ha.TestStandbyIsHot.testDatanodeRestarts(TestStandbyIsHot.java:188)


REGRESSION:  org.apache.hadoop.hdfs.web.TestWebHdfsFileSystemContract.testListStatus

Error Message:
null

Stack Trace:
junit.framework.AssertionFailedError: null
	at junit.framework.Assert.fail(Assert.java:55)
	at junit.framework.Assert.assertTrue(Assert.java:22)
	at junit.framework.Assert.assertTrue(Assert.java:31)
	at junit.framework.TestCase.assertTrue(TestCase.java:201)
	at org.apache.hadoop.fs.FileSystemContractBaseTest.testListStatus(FileSystemContractBaseTest.java:232)
	at sun.reflect.NativeMethodAccessorImpl.invoke0(Native Method)
	at sun.reflect.NativeMethodAccessorImpl.invoke(NativeMethodAccessorImpl.java:57)
	at sun.reflect.DelegatingMethodAccessorImpl.invoke(DelegatingMethodAccessorImpl.java:43)
	at java.lang.reflect.Method.invoke(Method.java:606)
	at junit.framework.TestCase.runTest(TestCase.java:176)
	at junit.framework.TestCase.runBare(TestCase.java:141)
	at junit.framework.TestResult$1.protect(TestResult.java:122)
	at junit.framework.TestResult.runProtected(TestResult.java:142)
	at junit.framework.TestResult.run(TestResult.java:125)
	at junit.framework.TestCase.run(TestCase.java:129)
	at junit.framework.TestSuite.runTest(TestSuite.java:255)
	at junit.framework.TestSuite.run(TestSuite.java:250)
	at org.junit.internal.runners.JUnit38ClassRunner.run(JUnit38ClassRunner.java:84)
	at org.apache.maven.surefire.junit4.JUnit4Provider.execute(JUnit4Provider.java:264)
	at org.apache.maven.surefire.junit4.JUnit4Provider.executeTestSet(JUnit4Provider.java:153)
	at org.apache.maven.surefire.junit4.JUnit4Provider.invoke(JUnit4Provider.java:124)
	at org.apache.maven.surefire.booter.ForkedBooter.invokeProviderInSameClassLoader(ForkedBooter.java:200)
	at org.apache.maven.surefire.booter.ForkedBooter.runSuitesInProcess(ForkedBooter.java:153)
	at org.apache.maven.surefire.booter.ForkedBooter.main(ForkedBooter.java:103)



Mime
  • Unnamed multipart/mixed (inline, None, 0 bytes)
View raw message