hadoop-hdfs-dev mailing list archives

Site index · List index
Message view « Date » · « Thread »
Top « Date » · « Thread »
From Apache Jenkins Server <jenk...@builds.apache.org>
Subject Hadoop-Hdfs-trunk-Java8 - Build # 223 - Failure
Date Sat, 20 Jun 2015 19:12:53 GMT
See https://builds.apache.org/job/Hadoop-Hdfs-trunk-Java8/223/

###################################################################################
########################## LAST 60 LINES OF THE CONSOLE ###########################
[...truncated 7394 lines...]
[INFO] --- maven-enforcer-plugin:1.3.1:enforce (dist-enforce) @ hadoop-hdfs-project ---
[INFO] 
[INFO] --- maven-site-plugin:3.4:attach-descriptor (attach-descriptor) @ hadoop-hdfs-project
---
[INFO] 
[INFO] --- maven-javadoc-plugin:2.8.1:jar (module-javadocs) @ hadoop-hdfs-project ---
[INFO] Not executing Javadoc as the project is not a Java classpath-capable package
[INFO] 
[INFO] --- maven-enforcer-plugin:1.3.1:enforce (depcheck) @ hadoop-hdfs-project ---
[INFO] 
[INFO] --- maven-checkstyle-plugin:2.15:checkstyle (default-cli) @ hadoop-hdfs-project ---
[INFO] 
[INFO] --- findbugs-maven-plugin:3.0.0:findbugs (default-cli) @ hadoop-hdfs-project ---
[INFO] ------------------------------------------------------------------------
[INFO] Reactor Summary:
[INFO] 
[INFO] Apache Hadoop HDFS Client ......................... SUCCESS [ 49.994 s]
[INFO] Apache Hadoop HDFS ................................ FAILURE [  02:49 h]
[INFO] Apache Hadoop HttpFS .............................. SKIPPED
[INFO] Apache Hadoop HDFS BookKeeper Journal ............. SKIPPED
[INFO] Apache Hadoop HDFS-NFS ............................ SKIPPED
[INFO] Apache Hadoop HDFS Project ........................ SUCCESS [  0.055 s]
[INFO] ------------------------------------------------------------------------
[INFO] BUILD FAILURE
[INFO] ------------------------------------------------------------------------
[INFO] Total time: 02:50 h
[INFO] Finished at: 2015-06-20T19:12:18+00:00
[INFO] Final Memory: 52M/152M
[INFO] ------------------------------------------------------------------------
[ERROR] Failed to execute goal org.apache.maven.plugins:maven-surefire-plugin:2.17:test (default-test)
on project hadoop-hdfs: There are test failures.
[ERROR] 
[ERROR] Please refer to /home/jenkins/jenkins-slave/workspace/Hadoop-Hdfs-trunk-Java8/hadoop-hdfs-project/hadoop-hdfs/target/surefire-reports
for the individual test results.
[ERROR] -> [Help 1]
[ERROR] 
[ERROR] To see the full stack trace of the errors, re-run Maven with the -e switch.
[ERROR] Re-run Maven using the -X switch to enable full debug logging.
[ERROR] 
[ERROR] For more information about the errors and possible solutions, please read the following
articles:
[ERROR] [Help 1] http://cwiki.apache.org/confluence/display/MAVEN/MojoFailureException
[ERROR] 
[ERROR] After correcting the problems, you can resume the build with the command
[ERROR]   mvn <goals> -rf :hadoop-hdfs
Build step 'Execute shell' marked build as failure
Archiving artifacts
Sending artifact delta relative to Hadoop-Hdfs-trunk-Java8 #222
Archived 1 artifacts
Archive block size is 32768
Received 0 blocks and 824641 bytes
Compression is 0.0%
Took 21 sec
Recording test results
Updating HDFS-8337
Updating HADOOP-12103
Updating MAPREDUCE-6405
Updating HDFS-7546
Updating HDFS-8582
Updating HDFS-8626
Sending e-mails to: hdfs-dev@hadoop.apache.org
Email was triggered for: Failure
Sending email for trigger: Failure



###################################################################################
############################## FAILED TESTS (if any) ##############################
3 tests failed.
REGRESSION:  org.apache.hadoop.hdfs.TestEncryptionZonesWithHA.testEncryptionZonesTrackedOnStandby

Error Message:
org/apache/hadoop/security/proto/SecurityProtos$TokenProtoOrBuilder

Stack Trace:
java.lang.NoClassDefFoundError: org/apache/hadoop/security/proto/SecurityProtos$TokenProtoOrBuilder
	at java.net.URLClassLoader$1.run(URLClassLoader.java:372)
	at java.net.URLClassLoader$1.run(URLClassLoader.java:361)
	at java.security.AccessController.doPrivileged(Native Method)
	at java.net.URLClassLoader.findClass(URLClassLoader.java:360)
	at java.lang.ClassLoader.loadClass(ClassLoader.java:424)
	at sun.misc.Launcher$AppClassLoader.loadClass(Launcher.java:308)
	at java.lang.ClassLoader.loadClass(ClassLoader.java:357)
	at org.apache.hadoop.hdfs.protocol.proto.HdfsProtos$LocatedBlocksProto.initFields(HdfsProtos.java:21507)
	at org.apache.hadoop.hdfs.protocol.proto.HdfsProtos$LocatedBlocksProto.<clinit>(HdfsProtos.java:22589)
	at org.apache.hadoop.hdfs.protocol.proto.HdfsProtos$HdfsFileStatusProto.initFields(HdfsProtos.java:23546)
	at org.apache.hadoop.hdfs.protocol.proto.HdfsProtos$HdfsFileStatusProto.<clinit>(HdfsProtos.java:25350)
	at org.apache.hadoop.hdfs.protocol.proto.ClientNamenodeProtocolProtos$CreateResponseProto.initFields(ClientNamenodeProtocolProtos.java:4503)
	at org.apache.hadoop.hdfs.protocol.proto.ClientNamenodeProtocolProtos$CreateResponseProto.<clinit>(ClientNamenodeProtocolProtos.java:4910)
	at org.apache.hadoop.hdfs.protocolPB.ClientNamenodeProtocolServerSideTranslatorPB.<clinit>(ClientNamenodeProtocolServerSideTranslatorPB.java:254)
	at org.apache.hadoop.hdfs.server.namenode.NameNodeRpcServer.<init>(NameNodeRpcServer.java:235)
	at org.apache.hadoop.hdfs.server.namenode.NameNode.createRpcServer(NameNode.java:673)
	at org.apache.hadoop.hdfs.server.namenode.NameNode.initialize(NameNode.java:646)
	at org.apache.hadoop.hdfs.server.namenode.NameNode.<init>(NameNode.java:809)
	at org.apache.hadoop.hdfs.server.namenode.NameNode.<init>(NameNode.java:793)
	at org.apache.hadoop.hdfs.server.namenode.NameNode.createNameNode(NameNode.java:1482)
	at org.apache.hadoop.hdfs.MiniDFSCluster.createNameNode(MiniDFSCluster.java:1114)
	at org.apache.hadoop.hdfs.MiniDFSCluster.createNameNodesAndSetConf(MiniDFSCluster.java:985)
	at org.apache.hadoop.hdfs.MiniDFSCluster.initMiniDFSCluster(MiniDFSCluster.java:814)
	at org.apache.hadoop.hdfs.MiniDFSCluster.<init>(MiniDFSCluster.java:471)
	at org.apache.hadoop.hdfs.MiniDFSCluster$Builder.build(MiniDFSCluster.java:430)
	at org.apache.hadoop.hdfs.TestEncryptionZonesWithHA.setupCluster(TestEncryptionZonesWithHA.java:70)


REGRESSION:  org.apache.hadoop.hdfs.server.namenode.metrics.TestNameNodeMetrics.testCorruptBlock

Error Message:
Bad value for metric PendingReplicationBlocks expected:<1> but was:<0>

Stack Trace:
java.lang.AssertionError: Bad value for metric PendingReplicationBlocks expected:<1>
but was:<0>
	at org.junit.Assert.fail(Assert.java:88)
	at org.junit.Assert.failNotEquals(Assert.java:743)
	at org.junit.Assert.assertEquals(Assert.java:118)
	at org.junit.Assert.assertEquals(Assert.java:555)
	at org.apache.hadoop.test.MetricsAsserts.assertGauge(MetricsAsserts.java:190)
	at org.apache.hadoop.hdfs.server.namenode.metrics.TestNameNodeMetrics.testCorruptBlock(TestNameNodeMetrics.java:256)


REGRESSION:  org.apache.hadoop.hdfs.web.TestWebHdfsTimeouts.testReadTimeout

Error Message:
expected:<Read timed out> but was:<null>

Stack Trace:
java.lang.AssertionError: expected:<Read timed out> but was:<null>
	at org.junit.Assert.fail(Assert.java:88)
	at org.junit.Assert.failNotEquals(Assert.java:743)
	at org.junit.Assert.assertEquals(Assert.java:118)
	at org.junit.Assert.assertEquals(Assert.java:144)
	at org.apache.hadoop.hdfs.web.TestWebHdfsTimeouts.testReadTimeout(TestWebHdfsTimeouts.java:131)



Mime
  • Unnamed multipart/mixed (inline, None, 0 bytes)
View raw message