hadoop-hdfs-dev mailing list archives

Site index · List index
Message view « Date » · « Thread »
Top « Date » · « Thread »
From Apache Jenkins Server <jenk...@builds.apache.org>
Subject Build failed in Jenkins: Hadoop-Hdfs-trunk #2134
Date Sat, 23 May 2015 14:17:37 GMT
See <https://builds.apache.org/job/Hadoop-Hdfs-trunk/2134/changes>

Changes:

[ozawa] MAPREDUCE-6204. TestJobCounters should use new properties instead of JobConf.MAPRED_TASK_JAVA_OPTS.

[cmccabe] HADOOP-11927.  Fix "undefined reference to dlopen" error when compiling libhadooppipes
(Xianyin Xin via Colin P. McCabe)

[xgong] YARN-3701. Isolating the error of generating a single app report when

[jianhe] YARN-3707. RM Web UI queue filter doesn't work. Contributed by Wangda Tan

------------------------------------------
[...truncated 6651 lines...]
Tests run: 1, Failures: 0, Errors: 0, Skipped: 0, Time elapsed: 5.189 sec - in org.apache.hadoop.hdfs.TestWriteConfigurationToDFS
Running org.apache.hadoop.hdfs.TestEncryptionZonesWithKMS
Tests run: 20, Failures: 0, Errors: 0, Skipped: 0, Time elapsed: 53.858 sec - in org.apache.hadoop.hdfs.TestEncryptionZonesWithKMS
Running org.apache.hadoop.hdfs.TestFileStatus
Tests run: 5, Failures: 0, Errors: 0, Skipped: 0, Time elapsed: 4.455 sec - in org.apache.hadoop.hdfs.TestFileStatus
Running org.apache.hadoop.hdfs.TestSmallBlock
Tests run: 2, Failures: 0, Errors: 0, Skipped: 0, Time elapsed: 5.79 sec - in org.apache.hadoop.hdfs.TestSmallBlock
Running org.apache.hadoop.hdfs.web.TestWebHDFS
Tests run: 12, Failures: 0, Errors: 0, Skipped: 0, Time elapsed: 107.672 sec - in org.apache.hadoop.hdfs.web.TestWebHDFS
Running org.apache.hadoop.hdfs.web.TestTokenAspect
Tests run: 6, Failures: 0, Errors: 0, Skipped: 0, Time elapsed: 1.45 sec - in org.apache.hadoop.hdfs.web.TestTokenAspect
Running org.apache.hadoop.hdfs.web.TestOffsetUrlInputStream
Tests run: 1, Failures: 0, Errors: 0, Skipped: 0, Time elapsed: 0.213 sec - in org.apache.hadoop.hdfs.web.TestOffsetUrlInputStream
Running org.apache.hadoop.hdfs.web.TestWebHdfsWithMultipleNameNodes
Tests run: 1, Failures: 0, Errors: 0, Skipped: 0, Time elapsed: 9.169 sec - in org.apache.hadoop.hdfs.web.TestWebHdfsWithMultipleNameNodes
Running org.apache.hadoop.hdfs.web.TestAuthFilter
Tests run: 3, Failures: 0, Errors: 0, Skipped: 0, Time elapsed: 0.702 sec - in org.apache.hadoop.hdfs.web.TestAuthFilter
Running org.apache.hadoop.hdfs.web.TestWebHdfsFileSystemContract
Tests run: 52, Failures: 0, Errors: 0, Skipped: 0, Time elapsed: 31.095 sec - in org.apache.hadoop.hdfs.web.TestWebHdfsFileSystemContract
Running org.apache.hadoop.hdfs.web.TestWebHdfsTokens
Tests run: 11, Failures: 0, Errors: 0, Skipped: 0, Time elapsed: 9.134 sec - in org.apache.hadoop.hdfs.web.TestWebHdfsTokens
Running org.apache.hadoop.hdfs.web.TestJsonUtil
Tests run: 8, Failures: 0, Errors: 0, Skipped: 0, Time elapsed: 0.625 sec - in org.apache.hadoop.hdfs.web.TestJsonUtil
Running org.apache.hadoop.hdfs.web.TestFSMainOperationsWebHdfs
Tests run: 52, Failures: 0, Errors: 0, Skipped: 0, Time elapsed: 10.092 sec - in org.apache.hadoop.hdfs.web.TestFSMainOperationsWebHdfs
Running org.apache.hadoop.hdfs.web.TestWebHDFSAcl
Tests run: 64, Failures: 0, Errors: 0, Skipped: 1, Time elapsed: 28.621 sec - in org.apache.hadoop.hdfs.web.TestWebHDFSAcl
Running org.apache.hadoop.hdfs.web.TestWebHdfsUrl
Tests run: 6, Failures: 0, Errors: 0, Skipped: 0, Time elapsed: 1.925 sec - in org.apache.hadoop.hdfs.web.TestWebHdfsUrl
Running org.apache.hadoop.hdfs.web.TestURLConnectionFactory
Tests run: 1, Failures: 0, Errors: 0, Skipped: 0, Time elapsed: 0.195 sec - in org.apache.hadoop.hdfs.web.TestURLConnectionFactory
Running org.apache.hadoop.hdfs.web.TestWebHDFSForHA
Tests run: 6, Failures: 0, Errors: 0, Skipped: 0, Time elapsed: 14.942 sec - in org.apache.hadoop.hdfs.web.TestWebHDFSForHA
Running org.apache.hadoop.hdfs.web.TestHttpsFileSystem
Tests run: 1, Failures: 0, Errors: 0, Skipped: 0, Time elapsed: 6.515 sec - in org.apache.hadoop.hdfs.web.TestHttpsFileSystem
Running org.apache.hadoop.hdfs.web.resources.TestParam
Tests run: 29, Failures: 0, Errors: 0, Skipped: 0, Time elapsed: 0.882 sec - in org.apache.hadoop.hdfs.web.resources.TestParam
Running org.apache.hadoop.hdfs.web.TestWebHdfsWithAuthenticationFilter
Tests run: 1, Failures: 0, Errors: 0, Skipped: 0, Time elapsed: 5.2 sec - in org.apache.hadoop.hdfs.web.TestWebHdfsWithAuthenticationFilter
Running org.apache.hadoop.hdfs.web.TestWebHdfsContentLength
Tests run: 7, Failures: 0, Errors: 0, Skipped: 0, Time elapsed: 1.365 sec - in org.apache.hadoop.hdfs.web.TestWebHdfsContentLength
Running org.apache.hadoop.hdfs.web.TestByteRangeInputStream
Tests run: 2, Failures: 0, Errors: 0, Skipped: 0, Time elapsed: 0.399 sec - in org.apache.hadoop.hdfs.web.TestByteRangeInputStream
Running org.apache.hadoop.hdfs.web.TestWebHDFSXAttr
Tests run: 12, Failures: 0, Errors: 0, Skipped: 0, Time elapsed: 16.027 sec - in org.apache.hadoop.hdfs.web.TestWebHDFSXAttr
Running org.apache.hadoop.hdfs.web.TestWebHdfsTimeouts
Tests run: 8, Failures: 0, Errors: 0, Skipped: 0, Time elapsed: 1.684 sec - in org.apache.hadoop.hdfs.web.TestWebHdfsTimeouts
Running org.apache.hadoop.hdfs.TestClientBlockVerification
Tests run: 4, Failures: 0, Errors: 0, Skipped: 0, Time elapsed: 4.931 sec - in org.apache.hadoop.hdfs.TestClientBlockVerification
Running org.apache.hadoop.hdfs.TestHDFSTrash
Tests run: 2, Failures: 0, Errors: 0, Skipped: 0, Time elapsed: 5.466 sec - in org.apache.hadoop.hdfs.TestHDFSTrash
Running org.apache.hadoop.net.TestNetworkTopology
Tests run: 10, Failures: 0, Errors: 0, Skipped: 0, Time elapsed: 8.887 sec - in org.apache.hadoop.net.TestNetworkTopology
Running org.apache.hadoop.security.TestPermission
Tests run: 3, Failures: 0, Errors: 0, Skipped: 0, Time elapsed: 5.939 sec - in org.apache.hadoop.security.TestPermission
Running org.apache.hadoop.security.TestRefreshUserMappings
Tests run: 2, Failures: 0, Errors: 0, Skipped: 0, Time elapsed: 5.728 sec - in org.apache.hadoop.security.TestRefreshUserMappings
Running org.apache.hadoop.security.TestPermissionSymlinks
Tests run: 15, Failures: 0, Errors: 0, Skipped: 0, Time elapsed: 5.489 sec - in org.apache.hadoop.security.TestPermissionSymlinks
Running org.apache.hadoop.cli.TestCacheAdminCLI
Tests run: 1, Failures: 0, Errors: 0, Skipped: 0, Time elapsed: 6.643 sec - in org.apache.hadoop.cli.TestCacheAdminCLI
Running org.apache.hadoop.cli.TestAclCLI
Tests run: 1, Failures: 0, Errors: 0, Skipped: 0, Time elapsed: 6.775 sec - in org.apache.hadoop.cli.TestAclCLI
Running org.apache.hadoop.cli.TestHDFSCLI
Tests run: 1, Failures: 0, Errors: 0, Skipped: 0, Time elapsed: 60.917 sec - in org.apache.hadoop.cli.TestHDFSCLI
Running org.apache.hadoop.cli.TestCryptoAdminCLI
Tests run: 1, Failures: 0, Errors: 0, Skipped: 0, Time elapsed: 7.196 sec - in org.apache.hadoop.cli.TestCryptoAdminCLI
Running org.apache.hadoop.cli.TestXAttrCLI
Tests run: 1, Failures: 0, Errors: 0, Skipped: 0, Time elapsed: 7.776 sec - in org.apache.hadoop.cli.TestXAttrCLI
Running org.apache.hadoop.tools.TestJMXGet
Tests run: 2, Failures: 0, Errors: 0, Skipped: 0, Time elapsed: 5.602 sec - in org.apache.hadoop.tools.TestJMXGet
Running org.apache.hadoop.tools.TestTools
Tests run: 5, Failures: 0, Errors: 0, Skipped: 0, Time elapsed: 1.44 sec - in org.apache.hadoop.tools.TestTools
Running org.apache.hadoop.tools.TestHdfsConfigFields
Tests run: 2, Failures: 0, Errors: 0, Skipped: 0, Time elapsed: 0.636 sec - in org.apache.hadoop.tools.TestHdfsConfigFields
Running org.apache.hadoop.fs.TestFcHdfsCreateMkdir
Tests run: 8, Failures: 0, Errors: 0, Skipped: 0, Time elapsed: 4.435 sec - in org.apache.hadoop.fs.TestFcHdfsCreateMkdir
Running org.apache.hadoop.fs.viewfs.TestViewFsWithXAttrs
Tests run: 1, Failures: 0, Errors: 0, Skipped: 0, Time elapsed: 4.396 sec - in org.apache.hadoop.fs.viewfs.TestViewFsWithXAttrs
Running org.apache.hadoop.fs.viewfs.TestViewFileSystemAtHdfsRoot
Tests run: 60, Failures: 0, Errors: 0, Skipped: 0, Time elapsed: 9.796 sec - in org.apache.hadoop.fs.viewfs.TestViewFileSystemAtHdfsRoot
Running org.apache.hadoop.fs.viewfs.TestViewFsAtHdfsRoot
Tests run: 58, Failures: 0, Errors: 0, Skipped: 0, Time elapsed: 8.555 sec - in org.apache.hadoop.fs.viewfs.TestViewFsAtHdfsRoot
Running org.apache.hadoop.fs.viewfs.TestViewFsHdfs
Tests run: 58, Failures: 0, Errors: 0, Skipped: 0, Time elapsed: 8.323 sec - in org.apache.hadoop.fs.viewfs.TestViewFsHdfs
Running org.apache.hadoop.fs.viewfs.TestViewFsWithAcls
Tests run: 1, Failures: 0, Errors: 0, Skipped: 0, Time elapsed: 4.527 sec - in org.apache.hadoop.fs.viewfs.TestViewFsWithAcls
Running org.apache.hadoop.fs.viewfs.TestViewFsDefaultValue
Tests run: 4, Failures: 0, Errors: 0, Skipped: 0, Time elapsed: 3.687 sec - in org.apache.hadoop.fs.viewfs.TestViewFsDefaultValue
Running org.apache.hadoop.fs.viewfs.TestViewFileSystemWithXAttrs
Tests run: 1, Failures: 0, Errors: 0, Skipped: 0, Time elapsed: 4.504 sec - in org.apache.hadoop.fs.viewfs.TestViewFileSystemWithXAttrs
Running org.apache.hadoop.fs.viewfs.TestViewFsFileStatusHdfs
Tests run: 2, Failures: 0, Errors: 0, Skipped: 0, Time elapsed: 3.589 sec - in org.apache.hadoop.fs.viewfs.TestViewFsFileStatusHdfs
Running org.apache.hadoop.fs.viewfs.TestViewFileSystemHdfs
Tests run: 60, Failures: 0, Errors: 0, Skipped: 0, Time elapsed: 9.955 sec - in org.apache.hadoop.fs.viewfs.TestViewFileSystemHdfs
Running org.apache.hadoop.fs.viewfs.TestViewFileSystemWithAcls
Tests run: 1, Failures: 0, Errors: 0, Skipped: 0, Time elapsed: 4.603 sec - in org.apache.hadoop.fs.viewfs.TestViewFileSystemWithAcls
Running org.apache.hadoop.fs.TestFcHdfsSetUMask
Tests run: 12, Failures: 0, Errors: 0, Skipped: 0, Time elapsed: 4.663 sec - in org.apache.hadoop.fs.TestFcHdfsSetUMask
Running org.apache.hadoop.fs.TestSymlinkHdfsFileSystem
Tests run: 72, Failures: 0, Errors: 0, Skipped: 2, Time elapsed: 9.921 sec - in org.apache.hadoop.fs.TestSymlinkHdfsFileSystem
Running org.apache.hadoop.fs.TestEnhancedByteBufferAccess
Tests run: 10, Failures: 0, Errors: 0, Skipped: 1, Time elapsed: 14.452 sec - in org.apache.hadoop.fs.TestEnhancedByteBufferAccess
Running org.apache.hadoop.fs.TestFcHdfsPermission
Tests run: 4, Failures: 0, Errors: 0, Skipped: 0, Time elapsed: 4.518 sec - in org.apache.hadoop.fs.TestFcHdfsPermission
Running org.apache.hadoop.fs.TestVolumeId
Tests run: 3, Failures: 0, Errors: 0, Skipped: 0, Time elapsed: 0.208 sec - in org.apache.hadoop.fs.TestVolumeId
Running org.apache.hadoop.fs.TestUrlStreamHandlerFactory
Tests run: 1, Failures: 0, Errors: 0, Skipped: 0, Time elapsed: 1.66 sec - in org.apache.hadoop.fs.TestUrlStreamHandlerFactory
Running org.apache.hadoop.fs.TestXAttr
Tests run: 2, Failures: 0, Errors: 0, Skipped: 0, Time elapsed: 0.09 sec - in org.apache.hadoop.fs.TestXAttr
Running org.apache.hadoop.fs.TestHDFSFileContextMainOperations
Tests run: 68, Failures: 0, Errors: 0, Skipped: 0, Time elapsed: 8.164 sec - in org.apache.hadoop.fs.TestHDFSFileContextMainOperations
Running org.apache.hadoop.fs.TestHdfsNativeCodeLoader
Tests run: 1, Failures: 0, Errors: 0, Skipped: 0, Time elapsed: 0.182 sec - in org.apache.hadoop.fs.TestHdfsNativeCodeLoader
Running org.apache.hadoop.fs.TestUrlStreamHandler
Tests run: 2, Failures: 0, Errors: 0, Skipped: 0, Time elapsed: 4.507 sec - in org.apache.hadoop.fs.TestUrlStreamHandler
Running org.apache.hadoop.fs.TestResolveHdfsSymlink
Tests run: 4, Failures: 0, Errors: 0, Skipped: 0, Time elapsed: 3.844 sec - in org.apache.hadoop.fs.TestResolveHdfsSymlink
Running org.apache.hadoop.fs.permission.TestStickyBit
Tests run: 6, Failures: 0, Errors: 0, Skipped: 0, Time elapsed: 8.359 sec - in org.apache.hadoop.fs.permission.TestStickyBit
Running org.apache.hadoop.fs.shell.TestHdfsTextCommand
Tests run: 1, Failures: 0, Errors: 0, Skipped: 0, Time elapsed: 4.577 sec - in org.apache.hadoop.fs.shell.TestHdfsTextCommand
Running org.apache.hadoop.fs.contract.hdfs.TestHDFSContractDelete
Tests run: 8, Failures: 0, Errors: 0, Skipped: 0, Time elapsed: 4.848 sec - in org.apache.hadoop.fs.contract.hdfs.TestHDFSContractDelete
Running org.apache.hadoop.fs.contract.hdfs.TestHDFSContractRename
Tests run: 6, Failures: 0, Errors: 0, Skipped: 0, Time elapsed: 4.975 sec - in org.apache.hadoop.fs.contract.hdfs.TestHDFSContractRename
Running org.apache.hadoop.fs.contract.hdfs.TestHDFSContractOpen
Tests run: 6, Failures: 0, Errors: 0, Skipped: 0, Time elapsed: 4.878 sec - in org.apache.hadoop.fs.contract.hdfs.TestHDFSContractOpen
Running org.apache.hadoop.fs.contract.hdfs.TestHDFSContractMkdir
Tests run: 5, Failures: 0, Errors: 0, Skipped: 0, Time elapsed: 4.857 sec - in org.apache.hadoop.fs.contract.hdfs.TestHDFSContractMkdir
Running org.apache.hadoop.fs.contract.hdfs.TestHDFSContractSeek
Tests run: 10, Failures: 0, Errors: 0, Skipped: 0, Time elapsed: 7.177 sec - in org.apache.hadoop.fs.contract.hdfs.TestHDFSContractSeek
Running org.apache.hadoop.fs.contract.hdfs.TestHDFSContractCreate
Tests run: 6, Failures: 0, Errors: 0, Skipped: 0, Time elapsed: 4.986 sec - in org.apache.hadoop.fs.contract.hdfs.TestHDFSContractCreate
Running org.apache.hadoop.fs.contract.hdfs.TestHDFSContractRootDirectory
Tests run: 5, Failures: 0, Errors: 0, Skipped: 0, Time elapsed: 4.067 sec - in org.apache.hadoop.fs.contract.hdfs.TestHDFSContractRootDirectory
Running org.apache.hadoop.fs.contract.hdfs.TestHDFSContractConcat
Tests run: 4, Failures: 0, Errors: 0, Skipped: 0, Time elapsed: 4.836 sec - in org.apache.hadoop.fs.contract.hdfs.TestHDFSContractConcat
Running org.apache.hadoop.fs.contract.hdfs.TestHDFSContractAppend
Tests run: 5, Failures: 0, Errors: 0, Skipped: 1, Time elapsed: 5.101 sec - in org.apache.hadoop.fs.contract.hdfs.TestHDFSContractAppend
Running org.apache.hadoop.fs.loadGenerator.TestLoadGenerator
Tests run: 2, Failures: 0, Errors: 0, Skipped: 0, Time elapsed: 14.633 sec - in org.apache.hadoop.fs.loadGenerator.TestLoadGenerator
Running org.apache.hadoop.fs.TestGlobPaths
Tests run: 35, Failures: 0, Errors: 0, Skipped: 6, Time elapsed: 5.466 sec - in org.apache.hadoop.fs.TestGlobPaths
Running org.apache.hadoop.fs.TestSymlinkHdfsDisable
Tests run: 1, Failures: 0, Errors: 0, Skipped: 0, Time elapsed: 3.94 sec - in org.apache.hadoop.fs.TestSymlinkHdfsDisable
Running org.apache.hadoop.fs.TestSymlinkHdfsFileContext
Tests run: 69, Failures: 0, Errors: 0, Skipped: 0, Time elapsed: 9.895 sec - in org.apache.hadoop.fs.TestSymlinkHdfsFileContext
Running org.apache.hadoop.fs.TestUnbuffer
Tests run: 2, Failures: 0, Errors: 0, Skipped: 0, Time elapsed: 7.392 sec - in org.apache.hadoop.fs.TestUnbuffer
Running org.apache.hadoop.TestGenericRefresh
Tests run: 9, Failures: 0, Errors: 0, Skipped: 0, Time elapsed: 4.024 sec - in org.apache.hadoop.TestGenericRefresh

Results :

Tests in error: 
  TestAppendSnapshotTruncate.testAST:128 ยป IllegalState dir has ERROR

Tests run: 3437, Failures: 0, Errors: 1, Skipped: 17

[INFO]                                                                         
[INFO] ------------------------------------------------------------------------
[INFO] Skipping Apache Hadoop HttpFS
[INFO] This project has been banned from the build due to previous failures.
[INFO] ------------------------------------------------------------------------
[INFO]                                                                         
[INFO] ------------------------------------------------------------------------
[INFO] Skipping Apache Hadoop HDFS BookKeeper Journal
[INFO] This project has been banned from the build due to previous failures.
[INFO] ------------------------------------------------------------------------
[INFO]                                                                         
[INFO] ------------------------------------------------------------------------
[INFO] Skipping Apache Hadoop HDFS-NFS
[INFO] This project has been banned from the build due to previous failures.
[INFO] ------------------------------------------------------------------------
[INFO]                                                                         
[INFO] ------------------------------------------------------------------------
[INFO] Building Apache Hadoop HDFS Project 3.0.0-SNAPSHOT
[INFO] ------------------------------------------------------------------------
[INFO] 
[INFO] --- maven-clean-plugin:2.5:clean (default-clean) @ hadoop-hdfs-project ---
[INFO] Deleting <https://builds.apache.org/job/Hadoop-Hdfs-trunk/ws/hadoop-hdfs-project/target>
[INFO] 
[INFO] --- maven-antrun-plugin:1.7:run (create-testdirs) @ hadoop-hdfs-project ---
[INFO] Executing tasks

main:
    [mkdir] Created dir: <https://builds.apache.org/job/Hadoop-Hdfs-trunk/ws/hadoop-hdfs-project/target/test-dir>
[INFO] Executed tasks
[INFO] 
[INFO] --- maven-source-plugin:2.3:jar-no-fork (hadoop-java-sources) @ hadoop-hdfs-project
---
[INFO] 
[INFO] --- maven-source-plugin:2.3:test-jar-no-fork (hadoop-java-sources) @ hadoop-hdfs-project
---
[INFO] 
[INFO] --- maven-enforcer-plugin:1.3.1:enforce (dist-enforce) @ hadoop-hdfs-project ---
[INFO] 
[INFO] --- maven-site-plugin:3.4:attach-descriptor (attach-descriptor) @ hadoop-hdfs-project
---
[INFO] 
[INFO] --- maven-javadoc-plugin:2.8.1:jar (module-javadocs) @ hadoop-hdfs-project ---
[INFO] Skipping javadoc generation
[INFO] 
[INFO] --- maven-enforcer-plugin:1.3.1:enforce (depcheck) @ hadoop-hdfs-project ---
[INFO] 
[INFO] --- maven-checkstyle-plugin:2.15:checkstyle (default-cli) @ hadoop-hdfs-project ---
[INFO] 
[INFO] --- findbugs-maven-plugin:3.0.0:findbugs (default-cli) @ hadoop-hdfs-project ---
[INFO] ------------------------------------------------------------------------
[INFO] Reactor Summary:
[INFO] 
[INFO] Apache Hadoop HDFS Client ......................... SUCCESS [ 46.291 s]
[INFO] Apache Hadoop HDFS ................................ FAILURE [  02:41 h]
[INFO] Apache Hadoop HttpFS .............................. SKIPPED
[INFO] Apache Hadoop HDFS BookKeeper Journal ............. SKIPPED
[INFO] Apache Hadoop HDFS-NFS ............................ SKIPPED
[INFO] Apache Hadoop HDFS Project ........................ SUCCESS [  0.068 s]
[INFO] ------------------------------------------------------------------------
[INFO] BUILD FAILURE
[INFO] ------------------------------------------------------------------------
[INFO] Total time: 02:42 h
[INFO] Finished at: 2015-05-23T14:16:49+00:00
[INFO] Final Memory: 60M/719M
[INFO] ------------------------------------------------------------------------
[ERROR] Failed to execute goal org.apache.maven.plugins:maven-surefire-plugin:2.17:test (default-test)
on project hadoop-hdfs: There are test failures.
[ERROR] 
[ERROR] Please refer to <https://builds.apache.org/job/Hadoop-Hdfs-trunk/ws/hadoop-hdfs-project/hadoop-hdfs/target/surefire-reports>
for the individual test results.
[ERROR] -> [Help 1]
[ERROR] 
[ERROR] To see the full stack trace of the errors, re-run Maven with the -e switch.
[ERROR] Re-run Maven using the -X switch to enable full debug logging.
[ERROR] 
[ERROR] For more information about the errors and possible solutions, please read the following
articles:
[ERROR] [Help 1] http://cwiki.apache.org/confluence/display/MAVEN/MojoFailureException
[ERROR] 
[ERROR] After correcting the problems, you can resume the build with the command
[ERROR]   mvn <goals> -rf :hadoop-hdfs
Build step 'Execute shell' marked build as failure
Archiving artifacts
Sending artifact delta relative to Hadoop-Hdfs-trunk #2116
Archived 1 artifacts
Archive block size is 32768
Received 0 blocks and 362646 bytes
Compression is 0.0%
Took 34 sec
Recording test results
Updating YARN-3701
Updating YARN-3707
Updating MAPREDUCE-6204
Updating HADOOP-11927

Mime
View raw message