hadoop-hdfs-dev mailing list archives

Site index · List index
Message view « Date » · « Thread »
Top « Date » · « Thread »
From Apache Jenkins Server <jenk...@builds.apache.org>
Subject Build failed in Jenkins: Hadoop-Hdfs-trunk #2133
Date Fri, 22 May 2015 14:20:40 GMT
See <https://builds.apache.org/job/Hadoop-Hdfs-trunk/2133/changes>

Changes:

[aajisaka] YARN-3694. Fix dead link for TimelineServer REST API. Contributed by Jagadesh Kiran
N.

[devaraj] YARN-3646. Applications are getting stuck some times in case of retry

[wheat9] HDFS-8421. Move startFile() and related functions into FSDirWriteFileOp. Contributed
by Haohui Mai.

[xyao] HDFS-8451. DFSClient probe for encryption testing interprets empty URI property for
enabled. Contributed by Steve Loughran.

[kasha] YARN-3675. FairScheduler: RM quits when node removal races with continuous-scheduling
on the same node. (Anubhav Dhoot via kasha)

[jghoman] HADOOP-12016. Typo in FileSystem::listStatusIterator. Contributed by Arthur Vigil.

[vinodkv] YARN-3684. Changed ContainerExecutor's primary lifecycle methods to use a more extensible
mechanism of context objects. Contributed by Sidharta Seethana.

[arp] HDFS-8454. Remove unnecessary throttling in TestDatanodeDeath. (Arpit Agarwal)

[aajisaka] HADOOP-12014. hadoop-config.cmd displays a wrong error message. Contributed by
Kengo Seki.

[aajisaka] HADOOP-11955. Fix a typo in the cluster setup doc. Contributed by Yanjun Wang.

[aajisaka] HADOOP-11594. Improve the readability of site index of documentation. Contributed
by Masatake Iwasaki.

[vinayakumarb] HDFS-8268. Port conflict log for data node server is not sufficient (Contributed
by Mohammad Shahid Khan)

[junping_du] YARN-3594. WintuilsProcessStubExecutor.startStreamReader leaks streams. Contributed
by Lars Francke.

[vinayakumarb] HADOOP-11743. maven doesn't clean all the site files (Contributed by ramtin)

------------------------------------------
[...truncated 6640 lines...]
Tests run: 6, Failures: 0, Errors: 0, Skipped: 0, Time elapsed: 30.763 sec - in org.apache.hadoop.hdfs.security.TestDelegationToken
Running org.apache.hadoop.hdfs.security.token.block.TestBlockToken
Tests run: 6, Failures: 0, Errors: 0, Skipped: 0, Time elapsed: 7.374 sec - in org.apache.hadoop.hdfs.security.token.block.TestBlockToken
Running org.apache.hadoop.hdfs.security.TestDelegationTokenForProxyUser
Tests run: 2, Failures: 0, Errors: 0, Skipped: 0, Time elapsed: 5.962 sec - in org.apache.hadoop.hdfs.security.TestDelegationTokenForProxyUser
Running org.apache.hadoop.hdfs.security.TestClientProtocolWithDelegationToken
Tests run: 1, Failures: 0, Errors: 0, Skipped: 0, Time elapsed: 1.819 sec - in org.apache.hadoop.hdfs.security.TestClientProtocolWithDelegationToken
Running org.apache.hadoop.hdfs.TestFileCorruption
Tests run: 3, Failures: 0, Errors: 0, Skipped: 0, Time elapsed: 7.594 sec - in org.apache.hadoop.hdfs.TestFileCorruption
Running org.apache.hadoop.hdfs.TestDFSInputStream
Tests run: 3, Failures: 0, Errors: 0, Skipped: 0, Time elapsed: 9.581 sec - in org.apache.hadoop.hdfs.TestDFSInputStream
Running org.apache.hadoop.hdfs.TestFileAppend4
Tests run: 4, Failures: 0, Errors: 0, Skipped: 0, Time elapsed: 29.71 sec - in org.apache.hadoop.hdfs.TestFileAppend4
Running org.apache.hadoop.hdfs.TestHdfsAdmin
Tests run: 2, Failures: 0, Errors: 0, Skipped: 0, Time elapsed: 3.965 sec - in org.apache.hadoop.hdfs.TestHdfsAdmin
Running org.apache.hadoop.hdfs.client.impl.TestLeaseRenewer
Tests run: 4, Failures: 0, Errors: 0, Skipped: 0, Time elapsed: 1.439 sec - in org.apache.hadoop.hdfs.client.impl.TestLeaseRenewer
Running org.apache.hadoop.hdfs.TestSnapshotCommands
Tests run: 6, Failures: 0, Errors: 0, Skipped: 0, Time elapsed: 4.248 sec - in org.apache.hadoop.hdfs.TestSnapshotCommands
Running org.apache.hadoop.hdfs.TestDFSInotifyEventInputStream
Tests run: 5, Failures: 0, Errors: 0, Skipped: 0, Time elapsed: 18.889 sec - in org.apache.hadoop.hdfs.TestDFSInotifyEventInputStream
Running org.apache.hadoop.hdfs.TestIsMethodSupported
Tests run: 10, Failures: 0, Errors: 0, Skipped: 0, Time elapsed: 4.16 sec - in org.apache.hadoop.hdfs.TestIsMethodSupported
Running org.apache.hadoop.hdfs.TestDFSStorageStateRecovery
Tests run: 3, Failures: 0, Errors: 0, Skipped: 0, Time elapsed: 63.957 sec - in org.apache.hadoop.hdfs.TestDFSStorageStateRecovery
Running org.apache.hadoop.hdfs.TestGetFileChecksum
Tests run: 2, Failures: 0, Errors: 0, Skipped: 0, Time elapsed: 8.752 sec - in org.apache.hadoop.hdfs.TestGetFileChecksum
Running org.apache.hadoop.hdfs.TestFileConcurrentReader
Tests run: 7, Failures: 0, Errors: 0, Skipped: 0, Time elapsed: 22.229 sec - in org.apache.hadoop.hdfs.TestFileConcurrentReader
Running org.apache.hadoop.hdfs.util.TestBestEffortLongFile
Tests run: 2, Failures: 0, Errors: 0, Skipped: 0, Time elapsed: 0.255 sec - in org.apache.hadoop.hdfs.util.TestBestEffortLongFile
Running org.apache.hadoop.hdfs.util.TestByteArrayManager
Tests run: 3, Failures: 0, Errors: 0, Skipped: 0, Time elapsed: 4.888 sec - in org.apache.hadoop.hdfs.util.TestByteArrayManager
Running org.apache.hadoop.hdfs.util.TestLightWeightLinkedSet
Tests run: 17, Failures: 0, Errors: 0, Skipped: 0, Time elapsed: 0.227 sec - in org.apache.hadoop.hdfs.util.TestLightWeightLinkedSet
Running org.apache.hadoop.hdfs.util.TestMD5FileUtils
Tests run: 5, Failures: 0, Errors: 0, Skipped: 0, Time elapsed: 0.306 sec - in org.apache.hadoop.hdfs.util.TestMD5FileUtils
Running org.apache.hadoop.hdfs.util.TestExactSizeInputStream
Tests run: 7, Failures: 0, Errors: 0, Skipped: 0, Time elapsed: 0.086 sec - in org.apache.hadoop.hdfs.util.TestExactSizeInputStream
Running org.apache.hadoop.hdfs.util.TestAtomicFileOutputStream
Tests run: 4, Failures: 0, Errors: 0, Skipped: 1, Time elapsed: 0.254 sec - in org.apache.hadoop.hdfs.util.TestAtomicFileOutputStream
Running org.apache.hadoop.hdfs.util.TestXMLUtils
Tests run: 6, Failures: 0, Errors: 0, Skipped: 0, Time elapsed: 0.086 sec - in org.apache.hadoop.hdfs.util.TestXMLUtils
Running org.apache.hadoop.hdfs.util.TestLightWeightHashSet
Tests run: 13, Failures: 0, Errors: 0, Skipped: 0, Time elapsed: 0.216 sec - in org.apache.hadoop.hdfs.util.TestLightWeightHashSet
Running org.apache.hadoop.hdfs.util.TestCyclicIteration
Tests run: 1, Failures: 0, Errors: 0, Skipped: 0, Time elapsed: 0.084 sec - in org.apache.hadoop.hdfs.util.TestCyclicIteration
Running org.apache.hadoop.hdfs.util.TestDiff
Tests run: 1, Failures: 0, Errors: 0, Skipped: 0, Time elapsed: 2.942 sec - in org.apache.hadoop.hdfs.util.TestDiff
Running org.apache.hadoop.hdfs.TestRemoteBlockReader
Tests run: 1, Failures: 0, Errors: 0, Skipped: 0, Time elapsed: 4.608 sec - in org.apache.hadoop.hdfs.TestRemoteBlockReader
Running org.apache.hadoop.hdfs.TestDFSStartupVersions
Tests run: 1, Failures: 0, Errors: 0, Skipped: 0, Time elapsed: 11.616 sec - in org.apache.hadoop.hdfs.TestDFSStartupVersions
Running org.apache.hadoop.hdfs.TestWriteBlockGetsBlockLengthHint
Tests run: 1, Failures: 0, Errors: 0, Skipped: 0, Time elapsed: 4.264 sec - in org.apache.hadoop.hdfs.TestWriteBlockGetsBlockLengthHint
Running org.apache.hadoop.hdfs.TestReservedRawPaths
Tests run: 8, Failures: 0, Errors: 0, Skipped: 0, Time elapsed: 9.695 sec - in org.apache.hadoop.hdfs.TestReservedRawPaths
Running org.apache.hadoop.hdfs.TestRead
Tests run: 3, Failures: 0, Errors: 0, Skipped: 0, Time elapsed: 6.341 sec - in org.apache.hadoop.hdfs.TestRead
Running org.apache.hadoop.hdfs.TestAppendDifferentChecksum
Tests run: 3, Failures: 0, Errors: 0, Skipped: 1, Time elapsed: 9.132 sec - in org.apache.hadoop.hdfs.TestAppendDifferentChecksum
Running org.apache.hadoop.hdfs.TestDFSRollback
Tests run: 1, Failures: 0, Errors: 0, Skipped: 0, Time elapsed: 13.932 sec - in org.apache.hadoop.hdfs.TestDFSRollback
Running org.apache.hadoop.hdfs.TestMiniDFSCluster
Tests run: 6, Failures: 0, Errors: 0, Skipped: 0, Time elapsed: 9.029 sec - in org.apache.hadoop.hdfs.TestMiniDFSCluster
Running org.apache.hadoop.hdfs.TestClientReportBadBlock
Tests run: 3, Failures: 0, Errors: 0, Skipped: 0, Time elapsed: 8.046 sec - in org.apache.hadoop.hdfs.TestClientReportBadBlock
Running org.apache.hadoop.hdfs.TestLeaseRecovery2
Tests run: 7, Failures: 0, Errors: 0, Skipped: 0, Time elapsed: 179.722 sec - in org.apache.hadoop.hdfs.TestLeaseRecovery2
Running org.apache.hadoop.hdfs.protocol.TestLayoutVersion
Tests run: 7, Failures: 0, Errors: 0, Skipped: 0, Time elapsed: 0.139 sec - in org.apache.hadoop.hdfs.protocol.TestLayoutVersion
Running org.apache.hadoop.hdfs.protocol.datatransfer.TestPacketReceiver
Tests run: 1, Failures: 0, Errors: 0, Skipped: 0, Time elapsed: 0.44 sec - in org.apache.hadoop.hdfs.protocol.datatransfer.TestPacketReceiver
Running org.apache.hadoop.hdfs.protocol.datatransfer.sasl.TestSaslDataTransfer
Tests run: 8, Failures: 0, Errors: 0, Skipped: 0, Time elapsed: 22.838 sec - in org.apache.hadoop.hdfs.protocol.datatransfer.sasl.TestSaslDataTransfer
Running org.apache.hadoop.hdfs.protocol.TestAnnotations
Tests run: 1, Failures: 0, Errors: 0, Skipped: 0, Time elapsed: 0.172 sec - in org.apache.hadoop.hdfs.protocol.TestAnnotations
Running org.apache.hadoop.hdfs.protocol.TestBlockListAsLongs
Tests run: 6, Failures: 0, Errors: 0, Skipped: 0, Time elapsed: 1.063 sec - in org.apache.hadoop.hdfs.protocol.TestBlockListAsLongs
Running org.apache.hadoop.hdfs.protocol.TestExtendedBlock
Tests run: 2, Failures: 0, Errors: 0, Skipped: 0, Time elapsed: 0.087 sec - in org.apache.hadoop.hdfs.protocol.TestExtendedBlock
Running org.apache.hadoop.hdfs.TestAbandonBlock
Tests run: 2, Failures: 0, Errors: 0, Skipped: 0, Time elapsed: 10.138 sec - in org.apache.hadoop.hdfs.TestAbandonBlock
Running org.apache.hadoop.hdfs.crypto.TestHdfsCryptoStreams
Tests run: 14, Failures: 0, Errors: 0, Skipped: 0, Time elapsed: 26.951 sec - in org.apache.hadoop.hdfs.crypto.TestHdfsCryptoStreams
Running org.apache.hadoop.hdfs.TestFileAppendRestart
Tests run: 3, Failures: 0, Errors: 0, Skipped: 0, Time elapsed: 14.448 sec - in org.apache.hadoop.hdfs.TestFileAppendRestart
Running org.apache.hadoop.hdfs.TestFetchImage
Tests run: 1, Failures: 0, Errors: 0, Skipped: 0, Time elapsed: 4.154 sec - in org.apache.hadoop.hdfs.TestFetchImage
Running org.apache.hadoop.hdfs.TestFileCreationDelete
Tests run: 1, Failures: 0, Errors: 0, Skipped: 0, Time elapsed: 15.134 sec - in org.apache.hadoop.hdfs.TestFileCreationDelete
Running org.apache.hadoop.hdfs.TestCrcCorruption
Tests run: 4, Failures: 0, Errors: 0, Skipped: 0, Time elapsed: 16.14 sec - in org.apache.hadoop.hdfs.TestCrcCorruption
Running org.apache.hadoop.hdfs.TestHDFSFileSystemContract
Tests run: 44, Failures: 0, Errors: 0, Skipped: 0, Time elapsed: 53.574 sec - in org.apache.hadoop.hdfs.TestHDFSFileSystemContract
Running org.apache.hadoop.hdfs.TestBlockStoragePolicy
Tests run: 17, Failures: 0, Errors: 0, Skipped: 0, Time elapsed: 38.424 sec - in org.apache.hadoop.hdfs.TestBlockStoragePolicy
Running org.apache.hadoop.hdfs.TestDatanodeDeath
Tests run: 4, Failures: 0, Errors: 0, Skipped: 0, Time elapsed: 60.495 sec - in org.apache.hadoop.hdfs.TestDatanodeDeath
Running org.apache.hadoop.hdfs.TestParallelReadUtil
Tests run: 1, Failures: 0, Errors: 0, Skipped: 1, Time elapsed: 0.039 sec - in org.apache.hadoop.hdfs.TestParallelReadUtil
Running org.apache.hadoop.hdfs.TestDFSUpgrade
Tests run: 3, Failures: 0, Errors: 0, Skipped: 0, Time elapsed: 14.495 sec - in org.apache.hadoop.hdfs.TestDFSUpgrade
Running org.apache.hadoop.hdfs.TestDFSShell
Tests run: 31, Failures: 0, Errors: 0, Skipped: 0, Time elapsed: 29.254 sec - in org.apache.hadoop.hdfs.TestDFSShell
Running org.apache.hadoop.hdfs.TestFileAppend2
Tests run: 4, Failures: 0, Errors: 0, Skipped: 0, Time elapsed: 24.387 sec - in org.apache.hadoop.hdfs.TestFileAppend2
Running org.apache.hadoop.hdfs.TestKeyProviderCache
Tests run: 1, Failures: 0, Errors: 0, Skipped: 0, Time elapsed: 0.566 sec - in org.apache.hadoop.hdfs.TestKeyProviderCache
Running org.apache.hadoop.hdfs.TestListFilesInDFS
Tests run: 2, Failures: 0, Errors: 0, Skipped: 0, Time elapsed: 4.701 sec - in org.apache.hadoop.hdfs.TestListFilesInDFS
Running org.apache.hadoop.hdfs.TestAppendSnapshotTruncate
Tests run: 1, Failures: 0, Errors: 0, Skipped: 0, Time elapsed: 15.609 sec - in org.apache.hadoop.hdfs.TestAppendSnapshotTruncate
Running org.apache.hadoop.hdfs.TestDFSOutputStream
Tests run: 3, Failures: 0, Errors: 0, Skipped: 0, Time elapsed: 8.871 sec - in org.apache.hadoop.hdfs.TestDFSOutputStream
Running org.apache.hadoop.hdfs.TestHDFSServerPorts
Tests run: 4, Failures: 0, Errors: 0, Skipped: 0, Time elapsed: 6.828 sec - in org.apache.hadoop.hdfs.TestHDFSServerPorts
Running org.apache.hadoop.hdfs.TestDFSPacket
Tests run: 2, Failures: 0, Errors: 0, Skipped: 0, Time elapsed: 0.119 sec - in org.apache.hadoop.hdfs.TestDFSPacket
Running org.apache.hadoop.hdfs.TestDFSClientExcludedNodes
Tests run: 2, Failures: 0, Errors: 0, Skipped: 0, Time elapsed: 11.814 sec - in org.apache.hadoop.hdfs.TestDFSClientExcludedNodes
Running org.apache.hadoop.hdfs.TestDFSPermission
Tests run: 7, Failures: 0, Errors: 0, Skipped: 0, Time elapsed: 20.143 sec - in org.apache.hadoop.hdfs.TestDFSPermission
Running org.apache.hadoop.hdfs.TestRestartDFS
Tests run: 2, Failures: 0, Errors: 0, Skipped: 0, Time elapsed: 13.406 sec - in org.apache.hadoop.hdfs.TestRestartDFS
Running org.apache.hadoop.cli.TestCryptoAdminCLI
Tests run: 1, Failures: 0, Errors: 0, Skipped: 0, Time elapsed: 7.253 sec - in org.apache.hadoop.cli.TestCryptoAdminCLI
Running org.apache.hadoop.cli.TestHDFSCLI
Tests run: 1, Failures: 0, Errors: 0, Skipped: 0, Time elapsed: 61.241 sec - in org.apache.hadoop.cli.TestHDFSCLI
Running org.apache.hadoop.cli.TestAclCLI
Tests run: 1, Failures: 0, Errors: 0, Skipped: 0, Time elapsed: 6.885 sec - in org.apache.hadoop.cli.TestAclCLI
Running org.apache.hadoop.cli.TestCacheAdminCLI
Tests run: 1, Failures: 0, Errors: 0, Skipped: 0, Time elapsed: 6.82 sec - in org.apache.hadoop.cli.TestCacheAdminCLI
Running org.apache.hadoop.cli.TestXAttrCLI
Tests run: 1, Failures: 0, Errors: 0, Skipped: 0, Time elapsed: 8.022 sec - in org.apache.hadoop.cli.TestXAttrCLI
Running org.apache.hadoop.TestRefreshCallQueue
Tests run: 1, Failures: 0, Errors: 0, Skipped: 0, Time elapsed: 4.019 sec - in org.apache.hadoop.TestRefreshCallQueue
Running org.apache.hadoop.security.TestPermissionSymlinks
Tests run: 15, Failures: 0, Errors: 0, Skipped: 0, Time elapsed: 5.577 sec - in org.apache.hadoop.security.TestPermissionSymlinks
Running org.apache.hadoop.security.TestPermission
Tests run: 3, Failures: 0, Errors: 0, Skipped: 0, Time elapsed: 6.112 sec - in org.apache.hadoop.security.TestPermission
Running org.apache.hadoop.security.TestRefreshUserMappings
Tests run: 2, Failures: 0, Errors: 0, Skipped: 0, Time elapsed: 5.844 sec - in org.apache.hadoop.security.TestRefreshUserMappings

Results :

Tests in error: 
  TestFileTruncate.testTruncateFailure ยป IO Failed to replace a bad datanode on ...

Tests run: 3437, Failures: 0, Errors: 1, Skipped: 17

[INFO]                                                                         
[INFO] ------------------------------------------------------------------------
[INFO] Skipping Apache Hadoop HttpFS
[INFO] This project has been banned from the build due to previous failures.
[INFO] ------------------------------------------------------------------------
[INFO]                                                                         
[INFO] ------------------------------------------------------------------------
[INFO] Skipping Apache Hadoop HDFS BookKeeper Journal
[INFO] This project has been banned from the build due to previous failures.
[INFO] ------------------------------------------------------------------------
[INFO]                                                                         
[INFO] ------------------------------------------------------------------------
[INFO] Skipping Apache Hadoop HDFS-NFS
[INFO] This project has been banned from the build due to previous failures.
[INFO] ------------------------------------------------------------------------
[INFO]                                                                         
[INFO] ------------------------------------------------------------------------
[INFO] Building Apache Hadoop HDFS Project 3.0.0-SNAPSHOT
[INFO] ------------------------------------------------------------------------
[INFO] 
[INFO] --- maven-clean-plugin:2.5:clean (default-clean) @ hadoop-hdfs-project ---
[INFO] Deleting <https://builds.apache.org/job/Hadoop-Hdfs-trunk/ws/hadoop-hdfs-project/target>
[INFO] 
[INFO] --- maven-antrun-plugin:1.7:run (create-testdirs) @ hadoop-hdfs-project ---
[INFO] Executing tasks

main:
    [mkdir] Created dir: <https://builds.apache.org/job/Hadoop-Hdfs-trunk/ws/hadoop-hdfs-project/target/test-dir>
[INFO] Executed tasks
[INFO] 
[INFO] --- maven-source-plugin:2.3:jar-no-fork (hadoop-java-sources) @ hadoop-hdfs-project
---
[INFO] 
[INFO] --- maven-source-plugin:2.3:test-jar-no-fork (hadoop-java-sources) @ hadoop-hdfs-project
---
[INFO] 
[INFO] --- maven-enforcer-plugin:1.3.1:enforce (dist-enforce) @ hadoop-hdfs-project ---
[INFO] 
[INFO] --- maven-site-plugin:3.4:attach-descriptor (attach-descriptor) @ hadoop-hdfs-project
---
[INFO] 
[INFO] --- maven-javadoc-plugin:2.8.1:jar (module-javadocs) @ hadoop-hdfs-project ---
[INFO] Skipping javadoc generation
[INFO] 
[INFO] --- maven-enforcer-plugin:1.3.1:enforce (depcheck) @ hadoop-hdfs-project ---
[INFO] 
[INFO] --- maven-checkstyle-plugin:2.15:checkstyle (default-cli) @ hadoop-hdfs-project ---
[INFO] 
[INFO] --- findbugs-maven-plugin:3.0.0:findbugs (default-cli) @ hadoop-hdfs-project ---
[INFO] ------------------------------------------------------------------------
[INFO] Reactor Summary:
[INFO] 
[INFO] Apache Hadoop HDFS Client ......................... SUCCESS [ 47.837 s]
[INFO] Apache Hadoop HDFS ................................ FAILURE [  02:42 h]
[INFO] Apache Hadoop HttpFS .............................. SKIPPED
[INFO] Apache Hadoop HDFS BookKeeper Journal ............. SKIPPED
[INFO] Apache Hadoop HDFS-NFS ............................ SKIPPED
[INFO] Apache Hadoop HDFS Project ........................ SUCCESS [  0.056 s]
[INFO] ------------------------------------------------------------------------
[INFO] BUILD FAILURE
[INFO] ------------------------------------------------------------------------
[INFO] Total time: 02:42 h
[INFO] Finished at: 2015-05-22T14:20:00+00:00
[INFO] Final Memory: 61M/678M
[INFO] ------------------------------------------------------------------------
[ERROR] Failed to execute goal org.apache.maven.plugins:maven-surefire-plugin:2.17:test (default-test)
on project hadoop-hdfs: There are test failures.
[ERROR] 
[ERROR] Please refer to <https://builds.apache.org/job/Hadoop-Hdfs-trunk/ws/hadoop-hdfs-project/hadoop-hdfs/target/surefire-reports>
for the individual test results.
[ERROR] -> [Help 1]
[ERROR] 
[ERROR] To see the full stack trace of the errors, re-run Maven with the -e switch.
[ERROR] Re-run Maven using the -X switch to enable full debug logging.
[ERROR] 
[ERROR] For more information about the errors and possible solutions, please read the following
articles:
[ERROR] [Help 1] http://cwiki.apache.org/confluence/display/MAVEN/MojoFailureException
[ERROR] 
[ERROR] After correcting the problems, you can resume the build with the command
[ERROR]   mvn <goals> -rf :hadoop-hdfs
Build step 'Execute shell' marked build as failure
Archiving artifacts
Sending artifact delta relative to Hadoop-Hdfs-trunk #2116
Archived 1 artifacts
Archive block size is 32768
Received 0 blocks and 363209 bytes
Compression is 0.0%
Took 23 sec
Recording test results
Updating YARN-3594
Updating HADOOP-11955
Updating HADOOP-11594
Updating HADOOP-12014
Updating HDFS-8421
Updating HADOOP-12016
Updating HDFS-8268
Updating HDFS-8451
Updating HDFS-8454
Updating YARN-3684
Updating HADOOP-11743
Updating YARN-3646
Updating YARN-3694
Updating YARN-3675

Mime
View raw message