hadoop-hdfs-dev mailing list archives

Site index · List index
Message view « Date » · « Thread »
Top « Date » · « Thread »
From Apache Jenkins Server <jenk...@builds.apache.org>
Subject Build failed in Jenkins: Hadoop-Hdfs-trunk-Java8 #183
Date Tue, 12 May 2015 14:48:41 GMT
See <https://builds.apache.org/job/Hadoop-Hdfs-trunk-Java8/183/changes>

Changes:

[junping_du] YARN-3587. Fix the javadoc of DelegationTokenSecretManager in yarn, etc. projects.
Contributed by Gabor Liptak.

[aajisaka] HDFS-8241. Remove unused NameNode startup option -finalize. Contributed by Brahma
Reddy Battula.

[aajisaka] HADOOP-11663. Remove description about Java 6 from docs. Contributed by Masatake
Iwasaki.

[aw] HADOOP-11928. Test-patch check for @author tags incorrectly flags removal of @author
tags (Kengo Seki via aw)

[aw] HADOOP-11951. test-patch should give better info about failures to handle dev-support
updates without resetrepo option (Sean Busbey via aw)

[aw] HADOOP-11950. Add cli option to test-patch to set the project-under-test (Sean Busbey
via aw)

[aw] HADOOP-11948. test-patch's issue matching regex should be configurable. (Sean Busbey
via aw)

[aw] HADOOP-11947. test-patch should return early from determine-issue when run in jenkins
mode. (Sean Busbey via aw)

[aw] re-commit of HADOOP-11881

[kihwal] HDFS-7916. 'reportBadBlocks' from datanodes to standby Node BPServiceActor goes for
infinite loop. Contributed by Rushabh Shah.

[wangda] Moved YARN-3434. (Interaction between reservations and userlimit can result in significant
ULF violation.) From 2.8.0 to 2.7.1

[jlowe] MAPREDUCE-5465. Tasks are often killed before they exit on their own. Contributed
by Ming Ma

[wangda] YARN-3489. RMServerUtils.validateResourceRequests should only obtain queue info once.
(Varun Saxena via wangda)

[wangda] Move YARN-3493 in CHANGES.txt from 2.8 to 2.7.1

[vinayakumarb] HDFS-8362. Java Compilation Error in TestHdfsConfigFields.java (Contributed
by Arshad Mohammad)

[vinayakumarb] MAPREDUCE-6360. TestMapreduceConfigFields is placed in wrong dir, introducing
compile error (Contributed by Arshad Mohammad)

[devaraj] YARN-3513. Remove unused variables in ContainersMonitorImpl and add debug

------------------------------------------
[...truncated 7205 lines...]
Running org.apache.hadoop.hdfs.util.TestXMLUtils
Tests run: 6, Failures: 0, Errors: 0, Skipped: 0, Time elapsed: 0.095 sec - in org.apache.hadoop.hdfs.util.TestXMLUtils
Java HotSpot(TM) 64-Bit Server VM warning: ignoring option MaxPermSize=768m; support was removed
in 8.0
Running org.apache.hadoop.hdfs.util.TestLightWeightHashSet
Tests run: 13, Failures: 0, Errors: 0, Skipped: 0, Time elapsed: 0.183 sec - in org.apache.hadoop.hdfs.util.TestLightWeightHashSet
Java HotSpot(TM) 64-Bit Server VM warning: ignoring option MaxPermSize=768m; support was removed
in 8.0
Running org.apache.hadoop.hdfs.util.TestMD5FileUtils
Tests run: 5, Failures: 0, Errors: 0, Skipped: 0, Time elapsed: 0.271 sec - in org.apache.hadoop.hdfs.util.TestMD5FileUtils
Java HotSpot(TM) 64-Bit Server VM warning: ignoring option MaxPermSize=768m; support was removed
in 8.0
Running org.apache.hadoop.hdfs.util.TestLightWeightLinkedSet
Tests run: 17, Failures: 0, Errors: 0, Skipped: 0, Time elapsed: 0.187 sec - in org.apache.hadoop.hdfs.util.TestLightWeightLinkedSet
Java HotSpot(TM) 64-Bit Server VM warning: ignoring option MaxPermSize=768m; support was removed
in 8.0
Running org.apache.hadoop.hdfs.util.TestAtomicFileOutputStream
Tests run: 4, Failures: 0, Errors: 0, Skipped: 1, Time elapsed: 0.233 sec - in org.apache.hadoop.hdfs.util.TestAtomicFileOutputStream
Java HotSpot(TM) 64-Bit Server VM warning: ignoring option MaxPermSize=768m; support was removed
in 8.0
Running org.apache.hadoop.hdfs.util.TestExactSizeInputStream
Tests run: 7, Failures: 0, Errors: 0, Skipped: 0, Time elapsed: 0.073 sec - in org.apache.hadoop.hdfs.util.TestExactSizeInputStream
Java HotSpot(TM) 64-Bit Server VM warning: ignoring option MaxPermSize=768m; support was removed
in 8.0
Running org.apache.hadoop.hdfs.TestLease
Tests run: 5, Failures: 0, Errors: 0, Skipped: 0, Time elapsed: 10.231 sec - in org.apache.hadoop.hdfs.TestLease
Java HotSpot(TM) 64-Bit Server VM warning: ignoring option MaxPermSize=768m; support was removed
in 8.0
Running org.apache.hadoop.hdfs.TestInjectionForSimulatedStorage
Tests run: 1, Failures: 0, Errors: 0, Skipped: 0, Time elapsed: 15.215 sec - in org.apache.hadoop.hdfs.TestInjectionForSimulatedStorage
Java HotSpot(TM) 64-Bit Server VM warning: ignoring option MaxPermSize=768m; support was removed
in 8.0
Running org.apache.hadoop.hdfs.TestHFlush
Tests run: 14, Failures: 0, Errors: 0, Skipped: 0, Time elapsed: 32.483 sec - in org.apache.hadoop.hdfs.TestHFlush
Java HotSpot(TM) 64-Bit Server VM warning: ignoring option MaxPermSize=768m; support was removed
in 8.0
Running org.apache.hadoop.hdfs.TestRemoteBlockReader
Tests run: 1, Failures: 0, Errors: 0, Skipped: 0, Time elapsed: 4.128 sec - in org.apache.hadoop.hdfs.TestRemoteBlockReader
Java HotSpot(TM) 64-Bit Server VM warning: ignoring option MaxPermSize=768m; support was removed
in 8.0
Running org.apache.hadoop.hdfs.TestHdfsAdmin
Tests run: 2, Failures: 0, Errors: 0, Skipped: 0, Time elapsed: 3.859 sec - in org.apache.hadoop.hdfs.TestHdfsAdmin
Java HotSpot(TM) 64-Bit Server VM warning: ignoring option MaxPermSize=768m; support was removed
in 8.0
Running org.apache.hadoop.hdfs.TestDistributedFileSystem
Tests run: 17, Failures: 0, Errors: 0, Skipped: 0, Time elapsed: 51.684 sec - in org.apache.hadoop.hdfs.TestDistributedFileSystem
Java HotSpot(TM) 64-Bit Server VM warning: ignoring option MaxPermSize=768m; support was removed
in 8.0
Running org.apache.hadoop.hdfs.TestRollingUpgradeRollback
Tests run: 3, Failures: 0, Errors: 0, Skipped: 0, Time elapsed: 11.8 sec - in org.apache.hadoop.hdfs.TestRollingUpgradeRollback
Java HotSpot(TM) 64-Bit Server VM warning: ignoring option MaxPermSize=768m; support was removed
in 8.0
Running org.apache.hadoop.hdfs.TestRollingUpgrade
Tests run: 9, Failures: 0, Errors: 0, Skipped: 0, Time elapsed: 107.295 sec - in org.apache.hadoop.hdfs.TestRollingUpgrade
Java HotSpot(TM) 64-Bit Server VM warning: ignoring option MaxPermSize=768m; support was removed
in 8.0
Running org.apache.hadoop.hdfs.TestDatanodeDeath
Tests run: 4, Failures: 0, Errors: 0, Skipped: 0, Time elapsed: 154.624 sec - in org.apache.hadoop.hdfs.TestDatanodeDeath
Java HotSpot(TM) 64-Bit Server VM warning: ignoring option MaxPermSize=768m; support was removed
in 8.0
Running org.apache.hadoop.hdfs.TestCrcCorruption
Tests run: 4, Failures: 0, Errors: 0, Skipped: 0, Time elapsed: 16.019 sec - in org.apache.hadoop.hdfs.TestCrcCorruption
Java HotSpot(TM) 64-Bit Server VM warning: ignoring option MaxPermSize=768m; support was removed
in 8.0
Running org.apache.hadoop.hdfs.TestFsShellPermission
Tests run: 1, Failures: 0, Errors: 0, Skipped: 0, Time elapsed: 4.74 sec - in org.apache.hadoop.hdfs.TestFsShellPermission
Java HotSpot(TM) 64-Bit Server VM warning: ignoring option MaxPermSize=768m; support was removed
in 8.0
Running org.apache.hadoop.hdfs.protocol.TestLayoutVersion
Tests run: 7, Failures: 0, Errors: 0, Skipped: 0, Time elapsed: 0.096 sec - in org.apache.hadoop.hdfs.protocol.TestLayoutVersion
Java HotSpot(TM) 64-Bit Server VM warning: ignoring option MaxPermSize=768m; support was removed
in 8.0
Running org.apache.hadoop.hdfs.protocol.datatransfer.sasl.TestSaslDataTransfer
Tests run: 8, Failures: 0, Errors: 0, Skipped: 0, Time elapsed: 18.09 sec - in org.apache.hadoop.hdfs.protocol.datatransfer.sasl.TestSaslDataTransfer
Java HotSpot(TM) 64-Bit Server VM warning: ignoring option MaxPermSize=768m; support was removed
in 8.0
Running org.apache.hadoop.hdfs.protocol.datatransfer.TestPacketReceiver
Tests run: 1, Failures: 0, Errors: 0, Skipped: 0, Time elapsed: 0.368 sec - in org.apache.hadoop.hdfs.protocol.datatransfer.TestPacketReceiver
Java HotSpot(TM) 64-Bit Server VM warning: ignoring option MaxPermSize=768m; support was removed
in 8.0
Running org.apache.hadoop.hdfs.protocol.TestAnnotations
Tests run: 1, Failures: 0, Errors: 0, Skipped: 0, Time elapsed: 0.146 sec - in org.apache.hadoop.hdfs.protocol.TestAnnotations
Java HotSpot(TM) 64-Bit Server VM warning: ignoring option MaxPermSize=768m; support was removed
in 8.0
Running org.apache.hadoop.hdfs.protocol.TestExtendedBlock
Tests run: 2, Failures: 0, Errors: 0, Skipped: 0, Time elapsed: 0.076 sec - in org.apache.hadoop.hdfs.protocol.TestExtendedBlock
Java HotSpot(TM) 64-Bit Server VM warning: ignoring option MaxPermSize=768m; support was removed
in 8.0
Running org.apache.hadoop.hdfs.protocol.TestBlockListAsLongs
Tests run: 6, Failures: 0, Errors: 0, Skipped: 0, Time elapsed: 0.986 sec - in org.apache.hadoop.hdfs.protocol.TestBlockListAsLongs
Java HotSpot(TM) 64-Bit Server VM warning: ignoring option MaxPermSize=768m; support was removed
in 8.0
Running org.apache.hadoop.hdfs.TestDFSAddressConfig
Tests run: 1, Failures: 0, Errors: 0, Skipped: 0, Time elapsed: 4.609 sec - in org.apache.hadoop.hdfs.TestDFSAddressConfig
Java HotSpot(TM) 64-Bit Server VM warning: ignoring option MaxPermSize=768m; support was removed
in 8.0
Running org.apache.hadoop.hdfs.TestDFSConfigKeys
Tests run: 1, Failures: 0, Errors: 0, Skipped: 0, Time elapsed: 0.187 sec - in org.apache.hadoop.hdfs.TestDFSConfigKeys
Java HotSpot(TM) 64-Bit Server VM warning: ignoring option MaxPermSize=768m; support was removed
in 8.0
Running org.apache.hadoop.hdfs.TestParallelUnixDomainRead
Tests run: 4, Failures: 0, Errors: 0, Skipped: 0, Time elapsed: 36.029 sec - in org.apache.hadoop.hdfs.TestParallelUnixDomainRead
Java HotSpot(TM) 64-Bit Server VM warning: ignoring option MaxPermSize=768m; support was removed
in 8.0
Running org.apache.hadoop.hdfs.TestReplication
Tests run: 7, Failures: 0, Errors: 0, Skipped: 0, Time elapsed: 39.45 sec - in org.apache.hadoop.hdfs.TestReplication
Java HotSpot(TM) 64-Bit Server VM warning: ignoring option MaxPermSize=768m; support was removed
in 8.0
Running org.apache.hadoop.hdfs.TestRead
Tests run: 3, Failures: 0, Errors: 0, Skipped: 0, Time elapsed: 6.507 sec - in org.apache.hadoop.hdfs.TestRead
Java HotSpot(TM) 64-Bit Server VM warning: ignoring option MaxPermSize=768m; support was removed
in 8.0
Running org.apache.hadoop.hdfs.TestPipelines
Tests run: 1, Failures: 0, Errors: 0, Skipped: 0, Time elapsed: 5.026 sec - in org.apache.hadoop.hdfs.TestPipelines
Java HotSpot(TM) 64-Bit Server VM warning: ignoring option MaxPermSize=768m; support was removed
in 8.0
Running org.apache.hadoop.hdfs.TestDeprecatedKeys
Tests run: 1, Failures: 0, Errors: 0, Skipped: 0, Time elapsed: 0.475 sec - in org.apache.hadoop.hdfs.TestDeprecatedKeys
Java HotSpot(TM) 64-Bit Server VM warning: ignoring option MaxPermSize=768m; support was removed
in 8.0
Running org.apache.hadoop.hdfs.TestParallelShortCircuitReadNoChecksum
Tests run: 4, Failures: 0, Errors: 0, Skipped: 0, Time elapsed: 12.287 sec - in org.apache.hadoop.hdfs.TestParallelShortCircuitReadNoChecksum
Java HotSpot(TM) 64-Bit Server VM warning: ignoring option MaxPermSize=768m; support was removed
in 8.0
Running org.apache.hadoop.hdfs.TestParallelShortCircuitRead
Tests run: 4, Failures: 0, Errors: 0, Skipped: 0, Time elapsed: 12.094 sec - in org.apache.hadoop.hdfs.TestParallelShortCircuitRead
Java HotSpot(TM) 64-Bit Server VM warning: ignoring option MaxPermSize=768m; support was removed
in 8.0
Running org.apache.hadoop.hdfs.TestHDFSTrash
Tests run: 2, Failures: 0, Errors: 0, Skipped: 0, Time elapsed: 5.08 sec - in org.apache.hadoop.hdfs.TestHDFSTrash
Java HotSpot(TM) 64-Bit Server VM warning: ignoring option MaxPermSize=768m; support was removed
in 8.0
Running org.apache.hadoop.hdfs.TestFileAppend
Tests run: 11, Failures: 0, Errors: 0, Skipped: 0, Time elapsed: 25.678 sec - in org.apache.hadoop.hdfs.TestFileAppend
Java HotSpot(TM) 64-Bit Server VM warning: ignoring option MaxPermSize=768m; support was removed
in 8.0
Running org.apache.hadoop.hdfs.TestDFSRemove
Tests run: 1, Failures: 0, Errors: 0, Skipped: 0, Time elapsed: 14.984 sec - in org.apache.hadoop.hdfs.TestDFSRemove
Java HotSpot(TM) 64-Bit Server VM warning: ignoring option MaxPermSize=768m; support was removed
in 8.0
Running org.apache.hadoop.hdfs.TestDFSRollback
Tests run: 1, Failures: 0, Errors: 0, Skipped: 0, Time elapsed: 15.479 sec - in org.apache.hadoop.hdfs.TestDFSRollback
Java HotSpot(TM) 64-Bit Server VM warning: ignoring option MaxPermSize=768m; support was removed
in 8.0
Running org.apache.hadoop.hdfs.TestReadWhileWriting
Tests run: 1, Failures: 0, Errors: 0, Skipped: 0, Time elapsed: 7.441 sec - in org.apache.hadoop.hdfs.TestReadWhileWriting
Java HotSpot(TM) 64-Bit Server VM warning: ignoring option MaxPermSize=768m; support was removed
in 8.0
Running org.apache.hadoop.hdfs.TestConnCache
Tests run: 1, Failures: 0, Errors: 0, Skipped: 0, Time elapsed: 3.884 sec - in org.apache.hadoop.hdfs.TestConnCache
Java HotSpot(TM) 64-Bit Server VM warning: ignoring option MaxPermSize=768m; support was removed
in 8.0
Running org.apache.hadoop.hdfs.TestPersistBlocks
Tests run: 5, Failures: 0, Errors: 0, Skipped: 0, Time elapsed: 24.637 sec - in org.apache.hadoop.hdfs.TestPersistBlocks
Java HotSpot(TM) 64-Bit Server VM warning: ignoring option MaxPermSize=768m; support was removed
in 8.0
Running org.apache.hadoop.hdfs.TestSetrepDecreasing
Tests run: 1, Failures: 0, Errors: 0, Skipped: 0, Time elapsed: 16.214 sec - in org.apache.hadoop.hdfs.TestSetrepDecreasing
Java HotSpot(TM) 64-Bit Server VM warning: ignoring option MaxPermSize=768m; support was removed
in 8.0
Running org.apache.hadoop.hdfs.TestDFSPacket
Tests run: 2, Failures: 0, Errors: 0, Skipped: 0, Time elapsed: 0.104 sec - in org.apache.hadoop.hdfs.TestDFSPacket
Java HotSpot(TM) 64-Bit Server VM warning: ignoring option MaxPermSize=768m; support was removed
in 8.0
Running org.apache.hadoop.hdfs.TestDatanodeLayoutUpgrade
Tests run: 1, Failures: 0, Errors: 0, Skipped: 0, Time elapsed: 5.937 sec - in org.apache.hadoop.hdfs.TestDatanodeLayoutUpgrade
Java HotSpot(TM) 64-Bit Server VM warning: ignoring option MaxPermSize=768m; support was removed
in 8.0
Running org.apache.hadoop.hdfs.TestFileCorruption
Tests run: 3, Failures: 0, Errors: 0, Skipped: 0, Time elapsed: 7.493 sec - in org.apache.hadoop.hdfs.TestFileCorruption
Java HotSpot(TM) 64-Bit Server VM warning: ignoring option MaxPermSize=768m; support was removed
in 8.0
Running org.apache.hadoop.hdfs.TestDFSStartupVersions
Tests run: 1, Failures: 0, Errors: 0, Skipped: 0, Time elapsed: 11.874 sec - in org.apache.hadoop.hdfs.TestDFSStartupVersions
Java HotSpot(TM) 64-Bit Server VM warning: ignoring option MaxPermSize=768m; support was removed
in 8.0
Running org.apache.hadoop.hdfs.TestWriteConfigurationToDFS
Tests run: 1, Failures: 0, Errors: 0, Skipped: 0, Time elapsed: 5.273 sec - in org.apache.hadoop.hdfs.TestWriteConfigurationToDFS
Java HotSpot(TM) 64-Bit Server VM warning: ignoring option MaxPermSize=768m; support was removed
in 8.0
Running org.apache.hadoop.hdfs.TestListFilesInDFS
Tests run: 2, Failures: 0, Errors: 0, Skipped: 0, Time elapsed: 4.376 sec - in org.apache.hadoop.hdfs.TestListFilesInDFS

Results :

Failed tests: 
  TestHdfsConfigFields>TestConfigurationFieldsBase.testCompareXmlAgainstConfigurationClass:468
hdfs-default.xml has 2 properties missing in  class org.apache.hadoop.hdfs.DFSConfigKeys

Tests in error: 
  TestTraceAdmin.testCreateAndDestroySpanReceiver:76->runTraceCommand:44 ยป Remote

Tests run: 3398, Failures: 1, Errors: 1, Skipped: 17

[INFO]                                                                         
[INFO] ------------------------------------------------------------------------
[INFO] Skipping Apache Hadoop HttpFS
[INFO] This project has been banned from the build due to previous failures.
[INFO] ------------------------------------------------------------------------
[INFO]                                                                         
[INFO] ------------------------------------------------------------------------
[INFO] Skipping Apache Hadoop HDFS BookKeeper Journal
[INFO] This project has been banned from the build due to previous failures.
[INFO] ------------------------------------------------------------------------
[INFO]                                                                         
[INFO] ------------------------------------------------------------------------
[INFO] Skipping Apache Hadoop HDFS-NFS
[INFO] This project has been banned from the build due to previous failures.
[INFO] ------------------------------------------------------------------------
[INFO]                                                                         
[INFO] ------------------------------------------------------------------------
[INFO] Building Apache Hadoop HDFS Project 3.0.0-SNAPSHOT
[INFO] ------------------------------------------------------------------------
[INFO] 
[INFO] --- maven-clean-plugin:2.5:clean (default-clean) @ hadoop-hdfs-project ---
[INFO] Deleting <https://builds.apache.org/job/Hadoop-Hdfs-trunk-Java8/ws/hadoop-hdfs-project/target>
[INFO] 
[INFO] --- maven-antrun-plugin:1.7:run (create-testdirs) @ hadoop-hdfs-project ---
[INFO] Executing tasks

main:
    [mkdir] Created dir: <https://builds.apache.org/job/Hadoop-Hdfs-trunk-Java8/ws/hadoop-hdfs-project/target/test-dir>
[INFO] Executed tasks
[INFO] 
[INFO] --- maven-source-plugin:2.3:jar-no-fork (hadoop-java-sources) @ hadoop-hdfs-project
---
[INFO] 
[INFO] --- maven-source-plugin:2.3:test-jar-no-fork (hadoop-java-sources) @ hadoop-hdfs-project
---
[INFO] 
[INFO] --- maven-enforcer-plugin:1.3.1:enforce (dist-enforce) @ hadoop-hdfs-project ---
[INFO] 
[INFO] --- maven-site-plugin:3.4:attach-descriptor (attach-descriptor) @ hadoop-hdfs-project
---
[INFO] 
[INFO] --- maven-javadoc-plugin:2.8.1:jar (module-javadocs) @ hadoop-hdfs-project ---
[INFO] Not executing Javadoc as the project is not a Java classpath-capable package
[INFO] 
[INFO] --- maven-enforcer-plugin:1.3.1:enforce (depcheck) @ hadoop-hdfs-project ---
[INFO] 
[INFO] --- maven-checkstyle-plugin:2.15:checkstyle (default-cli) @ hadoop-hdfs-project ---
[INFO] 
[INFO] --- findbugs-maven-plugin:3.0.0:findbugs (default-cli) @ hadoop-hdfs-project ---
[INFO] ------------------------------------------------------------------------
[INFO] Reactor Summary:
[INFO] 
[INFO] Apache Hadoop HDFS Client ......................... SUCCESS [ 56.966 s]
[INFO] Apache Hadoop HDFS ................................ FAILURE [  02:51 h]
[INFO] Apache Hadoop HttpFS .............................. SKIPPED
[INFO] Apache Hadoop HDFS BookKeeper Journal ............. SKIPPED
[INFO] Apache Hadoop HDFS-NFS ............................ SKIPPED
[INFO] Apache Hadoop HDFS Project ........................ SUCCESS [  0.066 s]
[INFO] ------------------------------------------------------------------------
[INFO] BUILD FAILURE
[INFO] ------------------------------------------------------------------------
[INFO] Total time: 02:52 h
[INFO] Finished at: 2015-05-12T14:47:50+00:00
[INFO] Final Memory: 52M/161M
[INFO] ------------------------------------------------------------------------
[ERROR] Failed to execute goal org.apache.maven.plugins:maven-surefire-plugin:2.17:test (default-test)
on project hadoop-hdfs: There are test failures.
[ERROR] 
[ERROR] Please refer to <https://builds.apache.org/job/Hadoop-Hdfs-trunk-Java8/ws/hadoop-hdfs-project/hadoop-hdfs/target/surefire-reports>
for the individual test results.
[ERROR] -> [Help 1]
[ERROR] 
[ERROR] To see the full stack trace of the errors, re-run Maven with the -e switch.
[ERROR] Re-run Maven using the -X switch to enable full debug logging.
[ERROR] 
[ERROR] For more information about the errors and possible solutions, please read the following
articles:
[ERROR] [Help 1] http://cwiki.apache.org/confluence/display/MAVEN/MojoFailureException
[ERROR] 
[ERROR] After correcting the problems, you can resume the build with the command
[ERROR]   mvn <goals> -rf :hadoop-hdfs
Build step 'Execute shell' marked build as failure
Archiving artifacts
Sending artifact delta relative to Hadoop-Hdfs-trunk-Java8 #175
Archived 1 artifacts
Archive block size is 32768
Received 0 blocks and 797725 bytes
Compression is 0.0%
Took 28 sec
Recording test results
Updating HADOOP-11947
Updating HDFS-8241
Updating HADOOP-11948
Updating HDFS-7916
Updating MAPREDUCE-5465
Updating HDFS-8362
Updating HADOOP-11881
Updating YARN-3587
Updating HADOOP-11928
Updating YARN-3434
Updating MAPREDUCE-6360
Updating YARN-3493
Updating HADOOP-11663
Updating YARN-3513
Updating HADOOP-11951
Updating YARN-3489
Updating HADOOP-11950

Mime
View raw message