hadoop-hdfs-dev mailing list archives

Site index · List index
Message view « Date » · « Thread »
Top « Date » · « Thread »
From Apache Jenkins Server <jenk...@builds.apache.org>
Subject Build failed in Jenkins: Hadoop-Hdfs-trunk #2123
Date Tue, 12 May 2015 14:41:51 GMT
See <https://builds.apache.org/job/Hadoop-Hdfs-trunk/2123/changes>

Changes:

[junping_du] YARN-3587. Fix the javadoc of DelegationTokenSecretManager in yarn, etc. projects.
Contributed by Gabor Liptak.

[aajisaka] HDFS-8241. Remove unused NameNode startup option -finalize. Contributed by Brahma
Reddy Battula.

[aajisaka] HADOOP-11663. Remove description about Java 6 from docs. Contributed by Masatake
Iwasaki.

[aw] HADOOP-11928. Test-patch check for @author tags incorrectly flags removal of @author
tags (Kengo Seki via aw)

[aw] HADOOP-11951. test-patch should give better info about failures to handle dev-support
updates without resetrepo option (Sean Busbey via aw)

[aw] HADOOP-11950. Add cli option to test-patch to set the project-under-test (Sean Busbey
via aw)

[aw] HADOOP-11948. test-patch's issue matching regex should be configurable. (Sean Busbey
via aw)

[aw] HADOOP-11947. test-patch should return early from determine-issue when run in jenkins
mode. (Sean Busbey via aw)

[aw] re-commit of HADOOP-11881

[kihwal] HDFS-7916. 'reportBadBlocks' from datanodes to standby Node BPServiceActor goes for
infinite loop. Contributed by Rushabh Shah.

[wangda] Moved YARN-3434. (Interaction between reservations and userlimit can result in significant
ULF violation.) From 2.8.0 to 2.7.1

[jlowe] MAPREDUCE-5465. Tasks are often killed before they exit on their own. Contributed
by Ming Ma

[wangda] YARN-3489. RMServerUtils.validateResourceRequests should only obtain queue info once.
(Varun Saxena via wangda)

[wangda] Move YARN-3493 in CHANGES.txt from 2.8 to 2.7.1

[vinayakumarb] HDFS-8362. Java Compilation Error in TestHdfsConfigFields.java (Contributed
by Arshad Mohammad)

[vinayakumarb] MAPREDUCE-6360. TestMapreduceConfigFields is placed in wrong dir, introducing
compile error (Contributed by Arshad Mohammad)

[devaraj] YARN-3513. Remove unused variables in ContainersMonitorImpl and add debug

------------------------------------------
[...truncated 6727 lines...]
Tests run: 4, Failures: 0, Errors: 0, Skipped: 0, Time elapsed: 3.894 sec - in org.apache.hadoop.fs.TestResolveHdfsSymlink
Running org.apache.hadoop.fs.TestVolumeId
Tests run: 3, Failures: 0, Errors: 0, Skipped: 0, Time elapsed: 0.222 sec - in org.apache.hadoop.fs.TestVolumeId
Running org.apache.hadoop.fs.viewfs.TestViewFsWithAcls
Tests run: 1, Failures: 0, Errors: 0, Skipped: 0, Time elapsed: 4.437 sec - in org.apache.hadoop.fs.viewfs.TestViewFsWithAcls
Running org.apache.hadoop.fs.viewfs.TestViewFsFileStatusHdfs
Tests run: 2, Failures: 0, Errors: 0, Skipped: 0, Time elapsed: 3.778 sec - in org.apache.hadoop.fs.viewfs.TestViewFsFileStatusHdfs
Running org.apache.hadoop.fs.viewfs.TestViewFileSystemHdfs
Tests run: 56, Failures: 0, Errors: 0, Skipped: 0, Time elapsed: 9.936 sec - in org.apache.hadoop.fs.viewfs.TestViewFileSystemHdfs
Running org.apache.hadoop.fs.viewfs.TestViewFsWithXAttrs
Tests run: 1, Failures: 0, Errors: 0, Skipped: 0, Time elapsed: 4.476 sec - in org.apache.hadoop.fs.viewfs.TestViewFsWithXAttrs
Running org.apache.hadoop.fs.viewfs.TestViewFsAtHdfsRoot
Tests run: 54, Failures: 0, Errors: 0, Skipped: 0, Time elapsed: 8.482 sec - in org.apache.hadoop.fs.viewfs.TestViewFsAtHdfsRoot
Running org.apache.hadoop.fs.viewfs.TestViewFsHdfs
Tests run: 54, Failures: 0, Errors: 0, Skipped: 0, Time elapsed: 8.388 sec - in org.apache.hadoop.fs.viewfs.TestViewFsHdfs
Running org.apache.hadoop.fs.viewfs.TestViewFileSystemWithAcls
Tests run: 1, Failures: 0, Errors: 0, Skipped: 0, Time elapsed: 4.615 sec - in org.apache.hadoop.fs.viewfs.TestViewFileSystemWithAcls
Running org.apache.hadoop.fs.viewfs.TestViewFileSystemAtHdfsRoot
Tests run: 56, Failures: 0, Errors: 0, Skipped: 0, Time elapsed: 9.612 sec - in org.apache.hadoop.fs.viewfs.TestViewFileSystemAtHdfsRoot
Running org.apache.hadoop.fs.viewfs.TestViewFileSystemWithXAttrs
Tests run: 1, Failures: 0, Errors: 0, Skipped: 0, Time elapsed: 4.547 sec - in org.apache.hadoop.fs.viewfs.TestViewFileSystemWithXAttrs
Running org.apache.hadoop.fs.viewfs.TestViewFsDefaultValue
Tests run: 4, Failures: 0, Errors: 0, Skipped: 0, Time elapsed: 3.723 sec - in org.apache.hadoop.fs.viewfs.TestViewFsDefaultValue
Running org.apache.hadoop.fs.TestSymlinkHdfsFileContext
Tests run: 69, Failures: 0, Errors: 0, Skipped: 0, Time elapsed: 9.85 sec - in org.apache.hadoop.fs.TestSymlinkHdfsFileContext
Running org.apache.hadoop.fs.contract.hdfs.TestHDFSContractDelete
Tests run: 8, Failures: 0, Errors: 0, Skipped: 0, Time elapsed: 4.882 sec - in org.apache.hadoop.fs.contract.hdfs.TestHDFSContractDelete
Running org.apache.hadoop.fs.contract.hdfs.TestHDFSContractMkdir
Tests run: 5, Failures: 0, Errors: 0, Skipped: 0, Time elapsed: 4.817 sec - in org.apache.hadoop.fs.contract.hdfs.TestHDFSContractMkdir
Running org.apache.hadoop.fs.contract.hdfs.TestHDFSContractOpen
Tests run: 6, Failures: 0, Errors: 0, Skipped: 0, Time elapsed: 4.878 sec - in org.apache.hadoop.fs.contract.hdfs.TestHDFSContractOpen
Running org.apache.hadoop.fs.contract.hdfs.TestHDFSContractRootDirectory
Tests run: 5, Failures: 0, Errors: 0, Skipped: 0, Time elapsed: 4.213 sec - in org.apache.hadoop.fs.contract.hdfs.TestHDFSContractRootDirectory
Running org.apache.hadoop.fs.contract.hdfs.TestHDFSContractAppend
Tests run: 5, Failures: 0, Errors: 0, Skipped: 1, Time elapsed: 5.12 sec - in org.apache.hadoop.fs.contract.hdfs.TestHDFSContractAppend
Running org.apache.hadoop.fs.contract.hdfs.TestHDFSContractCreate
Tests run: 6, Failures: 0, Errors: 0, Skipped: 0, Time elapsed: 5.001 sec - in org.apache.hadoop.fs.contract.hdfs.TestHDFSContractCreate
Running org.apache.hadoop.fs.contract.hdfs.TestHDFSContractSeek
Tests run: 10, Failures: 0, Errors: 0, Skipped: 0, Time elapsed: 7.601 sec - in org.apache.hadoop.fs.contract.hdfs.TestHDFSContractSeek
Running org.apache.hadoop.fs.contract.hdfs.TestHDFSContractRename
Tests run: 6, Failures: 0, Errors: 0, Skipped: 0, Time elapsed: 4.984 sec - in org.apache.hadoop.fs.contract.hdfs.TestHDFSContractRename
Running org.apache.hadoop.fs.contract.hdfs.TestHDFSContractConcat
Tests run: 4, Failures: 0, Errors: 0, Skipped: 0, Time elapsed: 4.791 sec - in org.apache.hadoop.fs.contract.hdfs.TestHDFSContractConcat
Running org.apache.hadoop.fs.permission.TestStickyBit
Tests run: 6, Failures: 0, Errors: 0, Skipped: 0, Time elapsed: 8.337 sec - in org.apache.hadoop.fs.permission.TestStickyBit
Running org.apache.hadoop.TestRefreshCallQueue
Tests run: 1, Failures: 0, Errors: 0, Skipped: 0, Time elapsed: 3.95 sec - in org.apache.hadoop.TestRefreshCallQueue
Running org.apache.hadoop.security.TestPermissionSymlinks
Tests run: 15, Failures: 0, Errors: 0, Skipped: 0, Time elapsed: 5.71 sec - in org.apache.hadoop.security.TestPermissionSymlinks
Running org.apache.hadoop.security.TestRefreshUserMappings
Tests run: 2, Failures: 0, Errors: 0, Skipped: 0, Time elapsed: 5.812 sec - in org.apache.hadoop.security.TestRefreshUserMappings
Running org.apache.hadoop.security.TestPermission
Tests run: 3, Failures: 0, Errors: 0, Skipped: 0, Time elapsed: 6.088 sec - in org.apache.hadoop.security.TestPermission
Running org.apache.hadoop.tools.TestTools
Tests run: 5, Failures: 0, Errors: 0, Skipped: 0, Time elapsed: 1.45 sec - in org.apache.hadoop.tools.TestTools
Running org.apache.hadoop.tools.TestJMXGet
Tests run: 2, Failures: 0, Errors: 0, Skipped: 0, Time elapsed: 5.526 sec - in org.apache.hadoop.tools.TestJMXGet
Running org.apache.hadoop.tools.TestHdfsConfigFields
Tests run: 2, Failures: 1, Errors: 0, Skipped: 0, Time elapsed: 0.627 sec <<< FAILURE!
- in org.apache.hadoop.tools.TestHdfsConfigFields
testCompareXmlAgainstConfigurationClass(org.apache.hadoop.tools.TestHdfsConfigFields)  Time
elapsed: 0.471 sec  <<< FAILURE!
java.lang.AssertionError: hdfs-default.xml has 2 properties missing in  class org.apache.hadoop.hdfs.DFSConfigKeys
	at org.junit.Assert.fail(Assert.java:88)
	at org.junit.Assert.assertTrue(Assert.java:41)
	at org.apache.hadoop.conf.TestConfigurationFieldsBase.testCompareXmlAgainstConfigurationClass(TestConfigurationFieldsBase.java:468)
	at sun.reflect.NativeMethodAccessorImpl.invoke0(Native Method)
	at sun.reflect.NativeMethodAccessorImpl.invoke(NativeMethodAccessorImpl.java:57)
	at sun.reflect.DelegatingMethodAccessorImpl.invoke(DelegatingMethodAccessorImpl.java:43)
	at java.lang.reflect.Method.invoke(Method.java:606)
	at org.junit.runners.model.FrameworkMethod$1.runReflectiveCall(FrameworkMethod.java:47)
	at org.junit.internal.runners.model.ReflectiveCallable.run(ReflectiveCallable.java:12)
	at org.junit.runners.model.FrameworkMethod.invokeExplosively(FrameworkMethod.java:44)
	at org.junit.internal.runners.statements.InvokeMethod.evaluate(InvokeMethod.java:17)
	at org.junit.internal.runners.statements.RunBefores.evaluate(RunBefores.java:26)
	at org.junit.runners.ParentRunner.runLeaf(ParentRunner.java:271)
	at org.junit.runners.BlockJUnit4ClassRunner.runChild(BlockJUnit4ClassRunner.java:70)
	at org.junit.runners.BlockJUnit4ClassRunner.runChild(BlockJUnit4ClassRunner.java:50)
	at org.junit.runners.ParentRunner$3.run(ParentRunner.java:238)
	at org.junit.runners.ParentRunner$1.schedule(ParentRunner.java:63)
	at org.junit.runners.ParentRunner.runChildren(ParentRunner.java:236)
	at org.junit.runners.ParentRunner.access$000(ParentRunner.java:53)
	at org.junit.runners.ParentRunner$2.evaluate(ParentRunner.java:229)
	at org.junit.runners.ParentRunner.run(ParentRunner.java:309)
	at org.apache.maven.surefire.junit4.JUnit4Provider.execute(JUnit4Provider.java:264)
	at org.apache.maven.surefire.junit4.JUnit4Provider.executeTestSet(JUnit4Provider.java:153)
	at org.apache.maven.surefire.junit4.JUnit4Provider.invoke(JUnit4Provider.java:124)
	at org.apache.maven.surefire.booter.ForkedBooter.invokeProviderInSameClassLoader(ForkedBooter.java:200)
	at org.apache.maven.surefire.booter.ForkedBooter.runSuitesInProcess(ForkedBooter.java:153)
	at org.apache.maven.surefire.booter.ForkedBooter.main(ForkedBooter.java:103)

Running org.apache.hadoop.tracing.TestTracing
Tests run: 1, Failures: 0, Errors: 0, Skipped: 0, Time elapsed: 5.244 sec - in org.apache.hadoop.tracing.TestTracing
Running org.apache.hadoop.tracing.TestTraceAdmin
Tests run: 1, Failures: 0, Errors: 1, Skipped: 0, Time elapsed: 4.1 sec <<< FAILURE!
- in org.apache.hadoop.tracing.TestTraceAdmin
testCreateAndDestroySpanReceiver(org.apache.hadoop.tracing.TestTraceAdmin)  Time elapsed:
4.018 sec  <<< ERROR!
org.apache.hadoop.ipc.RemoteException: Failed to load SpanReceiver org.apache.htrace.impl.LocalFileSpanReceiver
	at org.apache.hadoop.tracing.SpanReceiverHost.loadInstance(SpanReceiverHost.java:171)
	at org.apache.hadoop.tracing.SpanReceiverHost.addSpanReceiver(SpanReceiverHost.java:216)
	at org.apache.hadoop.hdfs.server.namenode.NameNodeRpcServer.addSpanReceiver(NameNodeRpcServer.java:2029)
	at org.apache.hadoop.tracing.TraceAdminProtocolServerSideTranslatorPB.addSpanReceiver(TraceAdminProtocolServerSideTranslatorPB.java:81)
	at org.apache.hadoop.tracing.TraceAdminPB$TraceAdminService$2.callBlockingMethod(TraceAdminPB.java:4580)
	at org.apache.hadoop.ipc.ProtobufRpcEngine$Server$ProtoBufRpcInvoker.call(ProtobufRpcEngine.java:636)
	at org.apache.hadoop.ipc.RPC$Server.call(RPC.java:976)
	at org.apache.hadoop.ipc.Server$Handler$1.run(Server.java:2174)
	at org.apache.hadoop.ipc.Server$Handler$1.run(Server.java:2170)
	at java.security.AccessController.doPrivileged(Native Method)
	at javax.security.auth.Subject.doAs(Subject.java:415)
	at org.apache.hadoop.security.UserGroupInformation.doAs(UserGroupInformation.java:1669)
	at org.apache.hadoop.ipc.Server$Handler.run(Server.java:2168)

	at org.apache.hadoop.ipc.Client.call(Client.java:1492)
	at org.apache.hadoop.ipc.Client.call(Client.java:1423)
	at org.apache.hadoop.ipc.ProtobufRpcEngine$Invoker.invoke(ProtobufRpcEngine.java:229)
	at com.sun.proxy.$Proxy21.addSpanReceiver(Unknown Source)
	at org.apache.hadoop.tracing.TraceAdminProtocolTranslatorPB.addSpanReceiver(TraceAdminProtocolTranslatorPB.java:81)
	at org.apache.hadoop.tracing.TraceAdmin.addSpanReceiver(TraceAdmin.java:120)
	at org.apache.hadoop.tracing.TraceAdmin.run(TraceAdmin.java:182)
	at org.apache.hadoop.tracing.TestTraceAdmin.runTraceCommand(TestTraceAdmin.java:44)
	at org.apache.hadoop.tracing.TestTraceAdmin.testCreateAndDestroySpanReceiver(TestTraceAdmin.java:74)

Running org.apache.hadoop.tracing.TestTracingShortCircuitLocalRead
Tests run: 1, Failures: 0, Errors: 0, Skipped: 0, Time elapsed: 4.769 sec - in org.apache.hadoop.tracing.TestTracingShortCircuitLocalRead
Running org.apache.hadoop.net.TestNetworkTopology
Tests run: 10, Failures: 0, Errors: 0, Skipped: 0, Time elapsed: 8.982 sec - in org.apache.hadoop.net.TestNetworkTopology
Running org.apache.hadoop.TestGenericRefresh
Tests run: 9, Failures: 0, Errors: 0, Skipped: 0, Time elapsed: 4.062 sec - in org.apache.hadoop.TestGenericRefresh
Running org.apache.hadoop.cli.TestHDFSCLI
Tests run: 1, Failures: 0, Errors: 0, Skipped: 0, Time elapsed: 61.364 sec - in org.apache.hadoop.cli.TestHDFSCLI
Running org.apache.hadoop.cli.TestCacheAdminCLI
Tests run: 1, Failures: 0, Errors: 0, Skipped: 0, Time elapsed: 6.697 sec - in org.apache.hadoop.cli.TestCacheAdminCLI
Running org.apache.hadoop.cli.TestAclCLI
Tests run: 1, Failures: 0, Errors: 0, Skipped: 0, Time elapsed: 6.809 sec - in org.apache.hadoop.cli.TestAclCLI
Running org.apache.hadoop.cli.TestCryptoAdminCLI
Tests run: 1, Failures: 0, Errors: 0, Skipped: 0, Time elapsed: 7.33 sec - in org.apache.hadoop.cli.TestCryptoAdminCLI
Running org.apache.hadoop.cli.TestXAttrCLI
Tests run: 1, Failures: 0, Errors: 0, Skipped: 0, Time elapsed: 7.778 sec - in org.apache.hadoop.cli.TestXAttrCLI

Results :

Failed tests: 
  TestHdfsConfigFields>TestConfigurationFieldsBase.testCompareXmlAgainstConfigurationClass:468
hdfs-default.xml has 2 properties missing in  class org.apache.hadoop.hdfs.DFSConfigKeys

Tests in error: 
  TestPeerCache.testDomainSocketPeers:270 » NoClassDefFound org/apache/hadoop/ne...
  TestFSImageWithXAttr.testPersistXAttr:106->testXAttr:87->restart:129 » Bind Po...
  TestTraceAdmin.testCreateAndDestroySpanReceiver:74->runTraceCommand:44 » Remote

Tests run: 3398, Failures: 1, Errors: 3, Skipped: 17

[INFO]                                                                         
[INFO] ------------------------------------------------------------------------
[INFO] Skipping Apache Hadoop HttpFS
[INFO] This project has been banned from the build due to previous failures.
[INFO] ------------------------------------------------------------------------
[INFO]                                                                         
[INFO] ------------------------------------------------------------------------
[INFO] Skipping Apache Hadoop HDFS BookKeeper Journal
[INFO] This project has been banned from the build due to previous failures.
[INFO] ------------------------------------------------------------------------
[INFO]                                                                         
[INFO] ------------------------------------------------------------------------
[INFO] Skipping Apache Hadoop HDFS-NFS
[INFO] This project has been banned from the build due to previous failures.
[INFO] ------------------------------------------------------------------------
[INFO]                                                                         
[INFO] ------------------------------------------------------------------------
[INFO] Building Apache Hadoop HDFS Project 3.0.0-SNAPSHOT
[INFO] ------------------------------------------------------------------------
[INFO] 
[INFO] --- maven-clean-plugin:2.5:clean (default-clean) @ hadoop-hdfs-project ---
[INFO] Deleting <https://builds.apache.org/job/Hadoop-Hdfs-trunk/ws/hadoop-hdfs-project/target>
[INFO] 
[INFO] --- maven-antrun-plugin:1.7:run (create-testdirs) @ hadoop-hdfs-project ---
[INFO] Executing tasks

main:
    [mkdir] Created dir: <https://builds.apache.org/job/Hadoop-Hdfs-trunk/ws/hadoop-hdfs-project/target/test-dir>
[INFO] Executed tasks
[INFO] 
[INFO] --- maven-source-plugin:2.3:jar-no-fork (hadoop-java-sources) @ hadoop-hdfs-project
---
[INFO] 
[INFO] --- maven-source-plugin:2.3:test-jar-no-fork (hadoop-java-sources) @ hadoop-hdfs-project
---
[INFO] 
[INFO] --- maven-enforcer-plugin:1.3.1:enforce (dist-enforce) @ hadoop-hdfs-project ---
[INFO] 
[INFO] --- maven-site-plugin:3.4:attach-descriptor (attach-descriptor) @ hadoop-hdfs-project
---
[INFO] 
[INFO] --- maven-javadoc-plugin:2.8.1:jar (module-javadocs) @ hadoop-hdfs-project ---
[INFO] Skipping javadoc generation
[INFO] 
[INFO] --- maven-enforcer-plugin:1.3.1:enforce (depcheck) @ hadoop-hdfs-project ---
[INFO] 
[INFO] --- maven-checkstyle-plugin:2.15:checkstyle (default-cli) @ hadoop-hdfs-project ---
[INFO] 
[INFO] --- findbugs-maven-plugin:3.0.0:findbugs (default-cli) @ hadoop-hdfs-project ---
[INFO] ------------------------------------------------------------------------
[INFO] Reactor Summary:
[INFO] 
[INFO] Apache Hadoop HDFS Client ......................... SUCCESS [ 46.284 s]
[INFO] Apache Hadoop HDFS ................................ FAILURE [  02:45 h]
[INFO] Apache Hadoop HttpFS .............................. SKIPPED
[INFO] Apache Hadoop HDFS BookKeeper Journal ............. SKIPPED
[INFO] Apache Hadoop HDFS-NFS ............................ SKIPPED
[INFO] Apache Hadoop HDFS Project ........................ SUCCESS [  0.064 s]
[INFO] ------------------------------------------------------------------------
[INFO] BUILD FAILURE
[INFO] ------------------------------------------------------------------------
[INFO] Total time: 02:46 h
[INFO] Finished at: 2015-05-12T14:41:08+00:00
[INFO] Final Memory: 53M/704M
[INFO] ------------------------------------------------------------------------
[ERROR] Failed to execute goal org.apache.maven.plugins:maven-surefire-plugin:2.17:test (default-test)
on project hadoop-hdfs: There are test failures.
[ERROR] 
[ERROR] Please refer to <https://builds.apache.org/job/Hadoop-Hdfs-trunk/ws/hadoop-hdfs-project/hadoop-hdfs/target/surefire-reports>
for the individual test results.
[ERROR] -> [Help 1]
[ERROR] 
[ERROR] To see the full stack trace of the errors, re-run Maven with the -e switch.
[ERROR] Re-run Maven using the -X switch to enable full debug logging.
[ERROR] 
[ERROR] For more information about the errors and possible solutions, please read the following
articles:
[ERROR] [Help 1] http://cwiki.apache.org/confluence/display/MAVEN/MojoFailureException
[ERROR] 
[ERROR] After correcting the problems, you can resume the build with the command
[ERROR]   mvn <goals> -rf :hadoop-hdfs
Build step 'Execute shell' marked build as failure
Archiving artifacts
Sending artifact delta relative to Hadoop-Hdfs-trunk #2116
Archived 1 artifacts
Archive block size is 32768
Received 0 blocks and 362827 bytes
Compression is 0.0%
Took 19 sec
Recording test results
Updating HADOOP-11947
Updating HDFS-8241
Updating HADOOP-11948
Updating HDFS-7916
Updating MAPREDUCE-5465
Updating HDFS-8362
Updating HADOOP-11881
Updating YARN-3587
Updating HADOOP-11928
Updating YARN-3434
Updating MAPREDUCE-6360
Updating YARN-3493
Updating HADOOP-11663
Updating YARN-3513
Updating HADOOP-11951
Updating YARN-3489
Updating HADOOP-11950

Mime
View raw message