hadoop-hdfs-dev mailing list archives

Site index · List index
Message view « Date » · « Thread »
Top « Date » · « Thread »
From Apache Jenkins Server <jenk...@builds.apache.org>
Subject Hadoop-Hdfs-trunk - Build # 2130 - Still Failing
Date Tue, 19 May 2015 14:22:12 GMT
See https://builds.apache.org/job/Hadoop-Hdfs-trunk/2130/

###################################################################################
########################## LAST 60 LINES OF THE CONSOLE ###########################
[...truncated 8073 lines...]
[INFO] --- maven-enforcer-plugin:1.3.1:enforce (depcheck) @ hadoop-hdfs-project ---
[INFO] 
[INFO] --- maven-checkstyle-plugin:2.15:checkstyle (default-cli) @ hadoop-hdfs-project ---
[INFO] 
[INFO] --- findbugs-maven-plugin:3.0.0:findbugs (default-cli) @ hadoop-hdfs-project ---
[INFO] ------------------------------------------------------------------------
[INFO] Reactor Summary:
[INFO] 
[INFO] Apache Hadoop HDFS Client ......................... SUCCESS [ 46.824 s]
[INFO] Apache Hadoop HDFS ................................ FAILURE [  02:46 h]
[INFO] Apache Hadoop HttpFS .............................. SKIPPED
[INFO] Apache Hadoop HDFS BookKeeper Journal ............. SKIPPED
[INFO] Apache Hadoop HDFS-NFS ............................ SKIPPED
[INFO] Apache Hadoop HDFS Project ........................ SUCCESS [  0.054 s]
[INFO] ------------------------------------------------------------------------
[INFO] BUILD FAILURE
[INFO] ------------------------------------------------------------------------
[INFO] Total time: 02:47 h
[INFO] Finished at: 2015-05-19T14:21:36+00:00
[INFO] Final Memory: 54M/696M
[INFO] ------------------------------------------------------------------------
[ERROR] Failed to execute goal org.apache.maven.plugins:maven-antrun-plugin:1.7:run (site)
on project hadoop-hdfs: An Ant BuildException has occured: /home/jenkins/jenkins-slave/workspace/Hadoop-Hdfs-trunk/hadoop-hdfs-project/hadoop-hdfs/src/main/docs
does not exist.
[ERROR] around Ant part ...<copy todir="/home/jenkins/jenkins-slave/workspace/Hadoop-Hdfs-trunk/hadoop-hdfs-project/hadoop-hdfs/target/docs-src">...
@ 5:121 in /home/jenkins/jenkins-slave/workspace/Hadoop-Hdfs-trunk/hadoop-hdfs-project/hadoop-hdfs/target/antrun/build-main.xml
[ERROR] -> [Help 1]
[ERROR] 
[ERROR] To see the full stack trace of the errors, re-run Maven with the -e switch.
[ERROR] Re-run Maven using the -X switch to enable full debug logging.
[ERROR] 
[ERROR] For more information about the errors and possible solutions, please read the following
articles:
[ERROR] [Help 1] http://cwiki.apache.org/confluence/display/MAVEN/MojoExecutionException
[ERROR] 
[ERROR] After correcting the problems, you can resume the build with the command
[ERROR]   mvn <goals> -rf :hadoop-hdfs
Build step 'Execute shell' marked build as failure
Archiving artifacts
Sending artifact delta relative to Hadoop-Hdfs-trunk #2116
Archived 1 artifacts
Archive block size is 32768
Received 0 blocks and 362791 bytes
Compression is 0.0%
Took 11 sec
Recording test results
Updating HADOOP-11581
Updating HADOOP-11949
Updating HADOOP-11944
Updating YARN-3541
Updating HADOOP-1540
Updating HADOOP-8934
Updating HADOOP-10971
Updating HADOOP-11103
Updating HADOOP-11884
Updating HDFS-8345
Updating HDFS-8405
Updating HDFS-8412
Updating HDFS-6348
Updating HDFS-4185
Sending e-mails to: hdfs-dev@hadoop.apache.org
Email was triggered for: Failure
Sending email for trigger: Failure



###################################################################################
############################## FAILED TESTS (if any) ##############################
All tests passed
Mime
  • Unnamed multipart/mixed (inline, None, 0 bytes)
View raw message