hadoop-hdfs-dev mailing list archives

Site index · List index
Message view « Date » · « Thread »
Top « Date » · « Thread »
From Apache Jenkins Server <jenk...@builds.apache.org>
Subject Build failed in Jenkins: Hadoop-Hdfs-trunk #2131
Date Wed, 20 May 2015 14:31:52 GMT
See <https://builds.apache.org/job/Hadoop-Hdfs-trunk/2131/changes>

Changes:

[kihwal] HDFS-8131. Implement a space balanced block placement policy. Contributed by Liu
Shaohui.

[xgong] YARN-3601. Fix UT TestRMFailover.testRMWebAppRedirect. Contributed by Weiwei Yang

[raviprak] YARN-3302. TestDockerContainerExecutor should run automatically if it can detect
docker in the usual place (Ravindra Kumar Naik via raviprak)

[cmccabe] HADOOP-11970. Replace uses of ThreadLocal<Random> with JDK7 ThreadLocalRandom
(Sean Busbey via Colin P. McCabe)

[kihwal] HDFS-8404. Pending block replication can get stuck using older genstamp. Contributed
by Nathan Roberts.

[junping_du] Moving MAPREDUCE-6361 to 2.7.1 CHANGES.txt

[Arun Suresh] HADOOP-11973. Ensure ZkDelegationTokenSecretManager namespace znodes get created
with ACLs. (Gregory Chanan via asuresh)

[cnauroth] HADOOP-11963. Metrics documentation for FSNamesystem misspells PendingDataNodeMessageCount.
Contributed by Anu Engineer.

[jianhe] YARN-2821. Fixed a problem that DistributedShell AM may hang if restarted. Contributed
by Varun Vasudev

[aw] HADOOP-12000. cannot use --java-home in test-patch (aw)

[wangda] YARN-3565. NodeHeartbeatRequest/RegisterNodeManagerRequest should use NodeLabel object
instead of String. (Naganarasimha G R via wangda)

[wangda] YARN-3583. Support of NodeLabel object instead of plain String in YarnClient side.
(Sunil G via wangda)

[ozawa] YARN-3677. Fix findbugs warnings in yarn-server-resourcemanager. Contributed by Vinod
Kumar Vavilapalli.

[wheat9] HADOOP-11995. Make jetty version configurable from the maven command line. Contributed
by Sriharsha Devineni.

[aajisaka] HADOOP-11698. Remove DistCpV1 and Logalyzer. Contributed by Brahma Reddy Battula.

------------------------------------------
[...truncated 6581 lines...]
Running org.apache.hadoop.hdfs.server.datanode.TestBlockHasMultipleReplicasOnSameDN
Tests run: 1, Failures: 0, Errors: 0, Skipped: 0, Time elapsed: 4.058 sec - in org.apache.hadoop.hdfs.server.datanode.TestBlockHasMultipleReplicasOnSameDN
Running org.apache.hadoop.hdfs.server.datanode.TestBlockReplacement
Tests run: 4, Failures: 0, Errors: 0, Skipped: 0, Time elapsed: 25.458 sec - in org.apache.hadoop.hdfs.server.datanode.TestBlockReplacement
Running org.apache.hadoop.hdfs.server.datanode.TestHdfsServerConstants
Tests run: 2, Failures: 0, Errors: 0, Skipped: 0, Time elapsed: 0.086 sec - in org.apache.hadoop.hdfs.server.datanode.TestHdfsServerConstants
Running org.apache.hadoop.hdfs.server.datanode.TestReadOnlySharedStorage
Tests run: 3, Failures: 0, Errors: 0, Skipped: 0, Time elapsed: 21.182 sec - in org.apache.hadoop.hdfs.server.datanode.TestReadOnlySharedStorage
Running org.apache.hadoop.hdfs.server.datanode.TestDeleteBlockPool
Tests run: 2, Failures: 0, Errors: 0, Skipped: 0, Time elapsed: 15.49 sec - in org.apache.hadoop.hdfs.server.datanode.TestDeleteBlockPool
Running org.apache.hadoop.hdfs.server.datanode.TestBlockScanner
Tests run: 12, Failures: 0, Errors: 0, Skipped: 0, Time elapsed: 35.053 sec - in org.apache.hadoop.hdfs.server.datanode.TestBlockScanner
Running org.apache.hadoop.hdfs.server.datanode.TestSimulatedFSDataset
Tests run: 9, Failures: 0, Errors: 0, Skipped: 0, Time elapsed: 1.265 sec - in org.apache.hadoop.hdfs.server.datanode.TestSimulatedFSDataset
Running org.apache.hadoop.hdfs.server.datanode.TestDataStorage
Tests run: 3, Failures: 0, Errors: 0, Skipped: 0, Time elapsed: 1.921 sec - in org.apache.hadoop.hdfs.server.datanode.TestDataStorage
Running org.apache.hadoop.hdfs.server.datanode.TestDataNodeUUID
Tests run: 1, Failures: 0, Errors: 0, Skipped: 0, Time elapsed: 1.892 sec - in org.apache.hadoop.hdfs.server.datanode.TestDataNodeUUID
Running org.apache.hadoop.hdfs.server.datanode.TestBlockRecovery
Tests run: 13, Failures: 0, Errors: 0, Skipped: 0, Time elapsed: 11.493 sec - in org.apache.hadoop.hdfs.server.datanode.TestBlockRecovery
Running org.apache.hadoop.hdfs.server.datanode.TestRefreshNamenodes
Tests run: 1, Failures: 0, Errors: 0, Skipped: 0, Time elapsed: 5.427 sec - in org.apache.hadoop.hdfs.server.datanode.TestRefreshNamenodes
Running org.apache.hadoop.hdfs.server.datanode.fsdataset.TestRoundRobinVolumeChoosingPolicy
Tests run: 2, Failures: 0, Errors: 0, Skipped: 0, Time elapsed: 0.371 sec - in org.apache.hadoop.hdfs.server.datanode.fsdataset.TestRoundRobinVolumeChoosingPolicy
Running org.apache.hadoop.hdfs.server.datanode.fsdataset.TestAvailableSpaceVolumeChoosingPolicy
Tests run: 11, Failures: 0, Errors: 0, Skipped: 0, Time elapsed: 9.773 sec - in org.apache.hadoop.hdfs.server.datanode.fsdataset.TestAvailableSpaceVolumeChoosingPolicy
Running org.apache.hadoop.hdfs.server.datanode.fsdataset.impl.TestLazyPersistFiles
Tests run: 7, Failures: 0, Errors: 0, Skipped: 0, Time elapsed: 112.487 sec - in org.apache.hadoop.hdfs.server.datanode.fsdataset.impl.TestLazyPersistFiles
Running org.apache.hadoop.hdfs.server.datanode.fsdataset.impl.TestLazyPersistReplicaRecovery
Tests run: 2, Failures: 0, Errors: 0, Skipped: 0, Time elapsed: 19.214 sec - in org.apache.hadoop.hdfs.server.datanode.fsdataset.impl.TestLazyPersistReplicaRecovery
Running org.apache.hadoop.hdfs.server.datanode.fsdataset.impl.TestLazyWriter
Tests run: 7, Failures: 0, Errors: 0, Skipped: 0, Time elapsed: 131.546 sec - in org.apache.hadoop.hdfs.server.datanode.fsdataset.impl.TestLazyWriter
Running org.apache.hadoop.hdfs.server.datanode.fsdataset.impl.TestDatanodeRestart
Tests run: 2, Failures: 0, Errors: 0, Skipped: 0, Time elapsed: 7.279 sec - in org.apache.hadoop.hdfs.server.datanode.fsdataset.impl.TestDatanodeRestart
Running org.apache.hadoop.hdfs.server.datanode.fsdataset.impl.TestReplicaMap
Tests run: 3, Failures: 0, Errors: 0, Skipped: 0, Time elapsed: 0.108 sec - in org.apache.hadoop.hdfs.server.datanode.fsdataset.impl.TestReplicaMap
Running org.apache.hadoop.hdfs.server.datanode.fsdataset.impl.TestLazyPersistPolicy
Tests run: 4, Failures: 0, Errors: 0, Skipped: 0, Time elapsed: 10.667 sec - in org.apache.hadoop.hdfs.server.datanode.fsdataset.impl.TestLazyPersistPolicy
Running org.apache.hadoop.hdfs.server.datanode.fsdataset.impl.TestFsVolumeList
Tests run: 3, Failures: 0, Errors: 0, Skipped: 0, Time elapsed: 1.005 sec - in org.apache.hadoop.hdfs.server.datanode.fsdataset.impl.TestFsVolumeList
Running org.apache.hadoop.hdfs.server.datanode.fsdataset.impl.TestLazyPersistLockedMemory
Tests run: 6, Failures: 0, Errors: 0, Skipped: 0, Time elapsed: 19.218 sec - in org.apache.hadoop.hdfs.server.datanode.fsdataset.impl.TestLazyPersistLockedMemory
Running org.apache.hadoop.hdfs.server.datanode.fsdataset.impl.TestWriteToReplica
Tests run: 5, Failures: 0, Errors: 0, Skipped: 0, Time elapsed: 7.796 sec - in org.apache.hadoop.hdfs.server.datanode.fsdataset.impl.TestWriteToReplica
Running org.apache.hadoop.hdfs.server.datanode.fsdataset.impl.TestFsDatasetImpl
Tests run: 6, Failures: 0, Errors: 0, Skipped: 0, Time elapsed: 6.596 sec - in org.apache.hadoop.hdfs.server.datanode.fsdataset.impl.TestFsDatasetImpl
Running org.apache.hadoop.hdfs.server.datanode.fsdataset.impl.TestLazyPersistReplicaPlacement
Tests run: 6, Failures: 0, Errors: 0, Skipped: 0, Time elapsed: 24.569 sec - in org.apache.hadoop.hdfs.server.datanode.fsdataset.impl.TestLazyPersistReplicaPlacement
Running org.apache.hadoop.hdfs.server.datanode.fsdataset.impl.TestScrLazyPersistFiles
Tests run: 8, Failures: 0, Errors: 0, Skipped: 0, Time elapsed: 117.957 sec - in org.apache.hadoop.hdfs.server.datanode.fsdataset.impl.TestScrLazyPersistFiles
Running org.apache.hadoop.hdfs.server.datanode.fsdataset.impl.TestRbwSpaceReservation
Tests run: 5, Failures: 0, Errors: 0, Skipped: 0, Time elapsed: 69.054 sec - in org.apache.hadoop.hdfs.server.datanode.fsdataset.impl.TestRbwSpaceReservation
Running org.apache.hadoop.hdfs.server.datanode.fsdataset.impl.TestInterDatanodeProtocol
Tests run: 5, Failures: 0, Errors: 0, Skipped: 0, Time elapsed: 7.519 sec - in org.apache.hadoop.hdfs.server.datanode.fsdataset.impl.TestInterDatanodeProtocol
Running org.apache.hadoop.hdfs.server.datanode.TestDataNodeMetrics
Tests run: 7, Failures: 0, Errors: 0, Skipped: 0, Time elapsed: 41.976 sec - in org.apache.hadoop.hdfs.server.datanode.TestDataNodeMetrics
Running org.apache.hadoop.hdfs.server.datanode.TestDirectoryScanner
Tests run: 4, Failures: 0, Errors: 0, Skipped: 0, Time elapsed: 10.576 sec - in org.apache.hadoop.hdfs.server.datanode.TestDirectoryScanner
Running org.apache.hadoop.hdfs.server.datanode.TestDatanodeRegister
Tests run: 2, Failures: 0, Errors: 0, Skipped: 0, Time elapsed: 0.648 sec - in org.apache.hadoop.hdfs.server.datanode.TestDatanodeRegister
Running org.apache.hadoop.hdfs.server.datanode.TestDatanodeStartupOptions
Tests run: 2, Failures: 0, Errors: 0, Skipped: 0, Time elapsed: 0.679 sec - in org.apache.hadoop.hdfs.server.datanode.TestDatanodeStartupOptions
Running org.apache.hadoop.hdfs.server.datanode.TestDataNodeVolumeFailureToleration
Tests run: 4, Failures: 0, Errors: 0, Skipped: 0, Time elapsed: 36.14 sec - in org.apache.hadoop.hdfs.server.datanode.TestDataNodeVolumeFailureToleration
Running org.apache.hadoop.hdfs.server.datanode.TestDatanodeProtocolRetryPolicy
Tests run: 1, Failures: 0, Errors: 0, Skipped: 0, Time elapsed: 5.422 sec - in org.apache.hadoop.hdfs.server.datanode.TestDatanodeProtocolRetryPolicy
Running org.apache.hadoop.hdfs.server.datanode.TestNNHandlesBlockReportPerStorage
Tests run: 9, Failures: 0, Errors: 0, Skipped: 0, Time elapsed: 49.46 sec - in org.apache.hadoop.hdfs.server.datanode.TestNNHandlesBlockReportPerStorage
Running org.apache.hadoop.hdfs.server.datanode.TestIncrementalBrVariations
Tests run: 4, Failures: 0, Errors: 0, Skipped: 0, Time elapsed: 12.556 sec - in org.apache.hadoop.hdfs.server.datanode.TestIncrementalBrVariations
Running org.apache.hadoop.hdfs.server.datanode.TestDnRespectsBlockReportSplitThreshold
Tests run: 3, Failures: 0, Errors: 0, Skipped: 0, Time elapsed: 6.381 sec - in org.apache.hadoop.hdfs.server.datanode.TestDnRespectsBlockReportSplitThreshold
Running org.apache.hadoop.hdfs.TestPeerCache
Tests run: 5, Failures: 0, Errors: 0, Skipped: 0, Time elapsed: 1.401 sec - in org.apache.hadoop.hdfs.TestPeerCache
Running org.apache.hadoop.hdfs.TestBlockReaderLocalLegacy
Tests run: 3, Failures: 0, Errors: 0, Skipped: 0, Time elapsed: 5.939 sec - in org.apache.hadoop.hdfs.TestBlockReaderLocalLegacy
Running org.apache.hadoop.hdfs.security.TestDelegationToken
Tests run: 6, Failures: 0, Errors: 0, Skipped: 0, Time elapsed: 30.763 sec - in org.apache.hadoop.hdfs.security.TestDelegationToken
Running org.apache.hadoop.hdfs.security.token.block.TestBlockToken
Tests run: 6, Failures: 0, Errors: 0, Skipped: 0, Time elapsed: 7.246 sec - in org.apache.hadoop.hdfs.security.token.block.TestBlockToken
Running org.apache.hadoop.hdfs.security.TestDelegationTokenForProxyUser
Tests run: 2, Failures: 0, Errors: 0, Skipped: 0, Time elapsed: 6.08 sec - in org.apache.hadoop.hdfs.security.TestDelegationTokenForProxyUser
Running org.apache.hadoop.hdfs.security.TestClientProtocolWithDelegationToken
Tests run: 1, Failures: 0, Errors: 0, Skipped: 0, Time elapsed: 1.916 sec - in org.apache.hadoop.hdfs.security.TestClientProtocolWithDelegationToken
Running org.apache.hadoop.hdfs.TestFileCorruption
Tests run: 3, Failures: 0, Errors: 0, Skipped: 0, Time elapsed: 7.649 sec - in org.apache.hadoop.hdfs.TestFileCorruption
Running org.apache.hadoop.hdfs.TestDFSInputStream
Tests run: 3, Failures: 0, Errors: 0, Skipped: 0, Time elapsed: 9.745 sec - in org.apache.hadoop.hdfs.TestDFSInputStream
Running org.apache.hadoop.hdfs.TestFileAppend4
Tests run: 4, Failures: 0, Errors: 0, Skipped: 0, Time elapsed: 29.89 sec - in org.apache.hadoop.hdfs.TestFileAppend4
Running org.apache.hadoop.hdfs.TestHdfsAdmin
Tests run: 2, Failures: 0, Errors: 0, Skipped: 0, Time elapsed: 3.996 sec - in org.apache.hadoop.hdfs.TestHdfsAdmin
Running org.apache.hadoop.hdfs.client.impl.TestLeaseRenewer
Tests run: 4, Failures: 0, Errors: 0, Skipped: 0, Time elapsed: 1.431 sec - in org.apache.hadoop.hdfs.client.impl.TestLeaseRenewer
Running org.apache.hadoop.hdfs.TestSnapshotCommands
Tests run: 6, Failures: 0, Errors: 0, Skipped: 0, Time elapsed: 4.299 sec - in org.apache.hadoop.hdfs.TestSnapshotCommands
Running org.apache.hadoop.hdfs.TestDFSInotifyEventInputStream
Tests run: 5, Failures: 0, Errors: 0, Skipped: 0, Time elapsed: 18.478 sec - in org.apache.hadoop.hdfs.TestDFSInotifyEventInputStream
Running org.apache.hadoop.hdfs.TestIsMethodSupported
Tests run: 10, Failures: 0, Errors: 0, Skipped: 0, Time elapsed: 4.035 sec - in org.apache.hadoop.hdfs.TestIsMethodSupported
Running org.apache.hadoop.hdfs.TestDFSStorageStateRecovery
Tests run: 3, Failures: 0, Errors: 0, Skipped: 0, Time elapsed: 63.715 sec - in org.apache.hadoop.hdfs.TestDFSStorageStateRecovery
Running org.apache.hadoop.hdfs.TestGetFileChecksum
Tests run: 2, Failures: 0, Errors: 0, Skipped: 0, Time elapsed: 8.657 sec - in org.apache.hadoop.hdfs.TestGetFileChecksum
Running org.apache.hadoop.hdfs.TestFileConcurrentReader
Tests run: 7, Failures: 0, Errors: 0, Skipped: 0, Time elapsed: 22.084 sec - in org.apache.hadoop.hdfs.TestFileConcurrentReader
Running org.apache.hadoop.hdfs.util.TestBestEffortLongFile
Tests run: 2, Failures: 0, Errors: 0, Skipped: 0, Time elapsed: 0.257 sec - in org.apache.hadoop.hdfs.util.TestBestEffortLongFile
Running org.apache.hadoop.hdfs.util.TestByteArrayManager
Tests run: 3, Failures: 0, Errors: 0, Skipped: 0, Time elapsed: 5.349 sec - in org.apache.hadoop.hdfs.util.TestByteArrayManager
Running org.apache.hadoop.hdfs.util.TestLightWeightLinkedSet
Tests run: 17, Failures: 0, Errors: 0, Skipped: 0, Time elapsed: 0.229 sec - in org.apache.hadoop.hdfs.util.TestLightWeightLinkedSet
Running org.apache.hadoop.hdfs.util.TestMD5FileUtils
Tests run: 5, Failures: 0, Errors: 0, Skipped: 0, Time elapsed: 0.321 sec - in org.apache.hadoop.hdfs.util.TestMD5FileUtils
Running org.apache.hadoop.hdfs.util.TestExactSizeInputStream
Tests run: 7, Failures: 0, Errors: 0, Skipped: 0, Time elapsed: 0.087 sec - in org.apache.hadoop.hdfs.util.TestExactSizeInputStream
Running org.apache.hadoop.hdfs.util.TestAtomicFileOutputStream
Tests run: 4, Failures: 0, Errors: 0, Skipped: 1, Time elapsed: 0.265 sec - in org.apache.hadoop.hdfs.util.TestAtomicFileOutputStream
Running org.apache.hadoop.hdfs.util.TestXMLUtils
Tests run: 6, Failures: 0, Errors: 0, Skipped: 0, Time elapsed: 0.088 sec - in org.apache.hadoop.hdfs.util.TestXMLUtils
Running org.apache.hadoop.hdfs.util.TestLightWeightHashSet
Tests run: 13, Failures: 0, Errors: 0, Skipped: 0, Time elapsed: 0.225 sec - in org.apache.hadoop.hdfs.util.TestLightWeightHashSet
Running org.apache.hadoop.hdfs.util.TestCyclicIteration
Tests run: 1, Failures: 0, Errors: 0, Skipped: 0, Time elapsed: 0.089 sec - in org.apache.hadoop.hdfs.util.TestCyclicIteration
Running org.apache.hadoop.hdfs.util.TestDiff
Tests run: 1, Failures: 0, Errors: 0, Skipped: 0, Time elapsed: 3.021 sec - in org.apache.hadoop.hdfs.util.TestDiff
Running org.apache.hadoop.hdfs.TestRemoteBlockReader
Tests run: 1, Failures: 0, Errors: 0, Skipped: 0, Time elapsed: 4.586 sec - in org.apache.hadoop.hdfs.TestRemoteBlockReader
Running org.apache.hadoop.hdfs.TestDFSStartupVersions
Tests run: 1, Failures: 0, Errors: 0, Skipped: 0, Time elapsed: 11.134 sec - in org.apache.hadoop.hdfs.TestDFSStartupVersions
Running org.apache.hadoop.hdfs.TestWriteBlockGetsBlockLengthHint
Tests run: 1, Failures: 0, Errors: 0, Skipped: 0, Time elapsed: 4.182 sec - in org.apache.hadoop.hdfs.TestWriteBlockGetsBlockLengthHint
Running org.apache.hadoop.hdfs.TestReservedRawPaths
Tests run: 8, Failures: 0, Errors: 0, Skipped: 0, Time elapsed: 9.792 sec - in org.apache.hadoop.hdfs.TestReservedRawPaths
Running org.apache.hadoop.hdfs.TestRead
Tests run: 3, Failures: 0, Errors: 0, Skipped: 0, Time elapsed: 6.293 sec - in org.apache.hadoop.hdfs.TestRead
Running org.apache.hadoop.hdfs.TestAppendDifferentChecksum
Tests run: 3, Failures: 0, Errors: 0, Skipped: 1, Time elapsed: 9.056 sec - in org.apache.hadoop.hdfs.TestAppendDifferentChecksum
Running org.apache.hadoop.hdfs.TestDFSRollback
Tests run: 1, Failures: 0, Errors: 0, Skipped: 0, Time elapsed: 13.837 sec - in org.apache.hadoop.hdfs.TestDFSRollback
Running org.apache.hadoop.hdfs.TestMiniDFSCluster
Tests run: 6, Failures: 0, Errors: 0, Skipped: 0, Time elapsed: 9.037 sec - in org.apache.hadoop.hdfs.TestMiniDFSCluster
Running org.apache.hadoop.hdfs.TestClientReportBadBlock
Tests run: 3, Failures: 0, Errors: 0, Skipped: 0, Time elapsed: 8.044 sec - in org.apache.hadoop.hdfs.TestClientReportBadBlock
Running org.apache.hadoop.hdfs.TestLeaseRecovery2

Results :

Tests in error: 
  TestHDFSConcat.startUpCluster:74 ยป IO Timed out waiting for Mini HDFS Cluster ...

Tests run: 3225, Failures: 0, Errors: 1, Skipped: 16

[INFO]                                                                         
[INFO] ------------------------------------------------------------------------
[INFO] Skipping Apache Hadoop HttpFS
[INFO] This project has been banned from the build due to previous failures.
[INFO] ------------------------------------------------------------------------
[INFO]                                                                         
[INFO] ------------------------------------------------------------------------
[INFO] Skipping Apache Hadoop HDFS BookKeeper Journal
[INFO] This project has been banned from the build due to previous failures.
[INFO] ------------------------------------------------------------------------
[INFO]                                                                         
[INFO] ------------------------------------------------------------------------
[INFO] Skipping Apache Hadoop HDFS-NFS
[INFO] This project has been banned from the build due to previous failures.
[INFO] ------------------------------------------------------------------------
[INFO]                                                                         
[INFO] ------------------------------------------------------------------------
[INFO] Building Apache Hadoop HDFS Project 3.0.0-SNAPSHOT
[INFO] ------------------------------------------------------------------------
[INFO] 
[INFO] --- maven-clean-plugin:2.5:clean (default-clean) @ hadoop-hdfs-project ---
[INFO] Deleting <https://builds.apache.org/job/Hadoop-Hdfs-trunk/ws/hadoop-hdfs-project/target>
[INFO] 
[INFO] --- maven-antrun-plugin:1.7:run (create-testdirs) @ hadoop-hdfs-project ---
[INFO] Executing tasks

main:
    [mkdir] Created dir: <https://builds.apache.org/job/Hadoop-Hdfs-trunk/ws/hadoop-hdfs-project/target/test-dir>
[INFO] Executed tasks
[INFO] 
[INFO] --- maven-source-plugin:2.3:jar-no-fork (hadoop-java-sources) @ hadoop-hdfs-project
---
[INFO] 
[INFO] --- maven-source-plugin:2.3:test-jar-no-fork (hadoop-java-sources) @ hadoop-hdfs-project
---
[INFO] 
[INFO] --- maven-enforcer-plugin:1.3.1:enforce (dist-enforce) @ hadoop-hdfs-project ---
[INFO] 
[INFO] --- maven-site-plugin:3.4:attach-descriptor (attach-descriptor) @ hadoop-hdfs-project
---
[INFO] 
[INFO] --- maven-javadoc-plugin:2.8.1:jar (module-javadocs) @ hadoop-hdfs-project ---
[INFO] Skipping javadoc generation
[INFO] 
[INFO] --- maven-enforcer-plugin:1.3.1:enforce (depcheck) @ hadoop-hdfs-project ---
[INFO] 
[INFO] --- maven-checkstyle-plugin:2.15:checkstyle (default-cli) @ hadoop-hdfs-project ---
[INFO] 
[INFO] --- findbugs-maven-plugin:3.0.0:findbugs (default-cli) @ hadoop-hdfs-project ---
[INFO] ------------------------------------------------------------------------
[INFO] Reactor Summary:
[INFO] 
[INFO] Apache Hadoop HDFS Client ......................... SUCCESS [ 46.867 s]
[INFO] Apache Hadoop HDFS ................................ FAILURE [  02:31 h]
[INFO] Apache Hadoop HttpFS .............................. SKIPPED
[INFO] Apache Hadoop HDFS BookKeeper Journal ............. SKIPPED
[INFO] Apache Hadoop HDFS-NFS ............................ SKIPPED
[INFO] Apache Hadoop HDFS Project ........................ SUCCESS [  0.081 s]
[INFO] ------------------------------------------------------------------------
[INFO] BUILD FAILURE
[INFO] ------------------------------------------------------------------------
[INFO] Total time: 02:31 h
[INFO] Finished at: 2015-05-20T14:31:21+00:00
[INFO] Final Memory: 65M/730M
[INFO] ------------------------------------------------------------------------
[ERROR] Failed to execute goal org.apache.maven.plugins:maven-surefire-plugin:2.17:test (default-test)
on project hadoop-hdfs: ExecutionException: org.apache.maven.surefire.booter.SurefireBooterForkException:
Error occurred in starting fork, check output in log -> [Help 1]
[ERROR] 
[ERROR] To see the full stack trace of the errors, re-run Maven with the -e switch.
[ERROR] Re-run Maven using the -X switch to enable full debug logging.
[ERROR] 
[ERROR] For more information about the errors and possible solutions, please read the following
articles:
[ERROR] [Help 1] http://cwiki.apache.org/confluence/display/MAVEN/MojoFailureException
[ERROR] 
[ERROR] After correcting the problems, you can resume the build with the command
[ERROR]   mvn <goals> -rf :hadoop-hdfs
Build step 'Execute shell' marked build as failure
Archiving artifacts
Sending artifact delta relative to Hadoop-Hdfs-trunk #2116
Archived 1 artifacts
Archive block size is 32768
Received 0 blocks and 363185 bytes
Compression is 0.0%
Took 5.9 sec
Recording test results
Updating HADOOP-11698
Updating HADOOP-11973
Updating YARN-3583
Updating YARN-3601
Updating HADOOP-11995
Updating HADOOP-12000
Updating HADOOP-11970
Updating YARN-3565
Updating YARN-2821
Updating MAPREDUCE-6361
Updating HDFS-8404
Updating YARN-3302
Updating HDFS-8131
Updating YARN-3677
Updating HADOOP-11963

Mime
View raw message