hadoop-hdfs-dev mailing list archives

Site index · List index
Message view « Date » · « Thread »
Top « Date » · « Thread »
From Apache Jenkins Server <jenk...@builds.apache.org>
Subject Build failed in Jenkins: Hadoop-Hdfs-trunk #2126
Date Fri, 15 May 2015 14:30:48 GMT
See <https://builds.apache.org/job/Hadoop-Hdfs-trunk/2126/changes>

Changes:

[devaraj] MAPREDUCE-5708. Duplicate String.format in

[junping_du] YARN-3505. Node's Log Aggregation Report with SUCCEED should not cached in RMApps.
Contributed by Xuan Gong.

[cnauroth] HADOOP-11713. ViewFileSystem should support snapshot methods. Contributed by Rakesh
R.

[raviprak] YARN-1519. Check in container-executor if sysconf is implemented before using it
(Radim Kolar and Eric Payne via raviprak)

[vinodkv] Fixing MR intermediate spills. Contributed by Arun Suresh.

[vinodkv] Fixing HDFS state-store. Contributed by Arun Suresh.

[aajisaka] HDFS-8371. Fix test failure in TestHdfsConfigFields for spanreceiver properties.
Contributed by Ray Chiang.

[aajisaka] HDFS-8350. Remove old webhdfs.xml and other outdated documentation stuff. Contributed
by Brahma Reddy Battula.

[cnauroth] HADOOP-11960. Enable Azure-Storage Client Side logging. Contributed by Dushyanth.

[vinayakumarb] HDFS-6888. Allow selectively audit logging ops (Contributed by Chen He)

[devaraj] MAPREDUCE-6273. HistoryFileManager should check whether summaryFile exists

------------------------------------------
[...truncated 6652 lines...]
Tests run: 5, Failures: 0, Errors: 0, Skipped: 0, Time elapsed: 1.397 sec - in org.apache.hadoop.hdfs.TestPeerCache
Running org.apache.hadoop.hdfs.TestBlockReaderLocalLegacy
Tests run: 3, Failures: 0, Errors: 0, Skipped: 0, Time elapsed: 6.133 sec - in org.apache.hadoop.hdfs.TestBlockReaderLocalLegacy
Running org.apache.hadoop.hdfs.security.TestDelegationToken
Tests run: 6, Failures: 0, Errors: 0, Skipped: 0, Time elapsed: 30.813 sec - in org.apache.hadoop.hdfs.security.TestDelegationToken
Running org.apache.hadoop.hdfs.security.token.block.TestBlockToken
Tests run: 6, Failures: 0, Errors: 0, Skipped: 0, Time elapsed: 7.191 sec - in org.apache.hadoop.hdfs.security.token.block.TestBlockToken
Running org.apache.hadoop.hdfs.security.TestDelegationTokenForProxyUser
Tests run: 2, Failures: 0, Errors: 0, Skipped: 0, Time elapsed: 5.91 sec - in org.apache.hadoop.hdfs.security.TestDelegationTokenForProxyUser
Running org.apache.hadoop.hdfs.security.TestClientProtocolWithDelegationToken
Tests run: 1, Failures: 0, Errors: 0, Skipped: 0, Time elapsed: 1.775 sec - in org.apache.hadoop.hdfs.security.TestClientProtocolWithDelegationToken
Running org.apache.hadoop.hdfs.TestFileCorruption
Tests run: 3, Failures: 0, Errors: 0, Skipped: 0, Time elapsed: 7.411 sec - in org.apache.hadoop.hdfs.TestFileCorruption
Running org.apache.hadoop.hdfs.TestDFSInputStream
Tests run: 3, Failures: 0, Errors: 0, Skipped: 0, Time elapsed: 9.287 sec - in org.apache.hadoop.hdfs.TestDFSInputStream
Running org.apache.hadoop.hdfs.TestFileAppend4
Tests run: 4, Failures: 0, Errors: 0, Skipped: 0, Time elapsed: 30.68 sec - in org.apache.hadoop.hdfs.TestFileAppend4
Running org.apache.hadoop.hdfs.TestHdfsAdmin
Tests run: 2, Failures: 0, Errors: 0, Skipped: 0, Time elapsed: 3.992 sec - in org.apache.hadoop.hdfs.TestHdfsAdmin
Running org.apache.hadoop.hdfs.client.impl.TestLeaseRenewer
Tests run: 4, Failures: 0, Errors: 0, Skipped: 0, Time elapsed: 1.441 sec - in org.apache.hadoop.hdfs.client.impl.TestLeaseRenewer
Running org.apache.hadoop.hdfs.TestSnapshotCommands
Tests run: 6, Failures: 0, Errors: 0, Skipped: 0, Time elapsed: 4.248 sec - in org.apache.hadoop.hdfs.TestSnapshotCommands
Running org.apache.hadoop.hdfs.TestDFSInotifyEventInputStream
Tests run: 5, Failures: 0, Errors: 0, Skipped: 0, Time elapsed: 18.14 sec - in org.apache.hadoop.hdfs.TestDFSInotifyEventInputStream
Running org.apache.hadoop.hdfs.TestIsMethodSupported
Tests run: 10, Failures: 0, Errors: 0, Skipped: 0, Time elapsed: 3.942 sec - in org.apache.hadoop.hdfs.TestIsMethodSupported
Running org.apache.hadoop.hdfs.TestDFSStorageStateRecovery
Tests run: 3, Failures: 0, Errors: 0, Skipped: 0, Time elapsed: 63.368 sec - in org.apache.hadoop.hdfs.TestDFSStorageStateRecovery
Running org.apache.hadoop.hdfs.TestGetFileChecksum
Tests run: 2, Failures: 0, Errors: 0, Skipped: 0, Time elapsed: 8.711 sec - in org.apache.hadoop.hdfs.TestGetFileChecksum
Running org.apache.hadoop.hdfs.TestFileConcurrentReader
Tests run: 7, Failures: 0, Errors: 0, Skipped: 0, Time elapsed: 22.43 sec - in org.apache.hadoop.hdfs.TestFileConcurrentReader
Running org.apache.hadoop.hdfs.util.TestBestEffortLongFile
Tests run: 2, Failures: 0, Errors: 0, Skipped: 0, Time elapsed: 0.252 sec - in org.apache.hadoop.hdfs.util.TestBestEffortLongFile
Running org.apache.hadoop.hdfs.util.TestByteArrayManager
Tests run: 3, Failures: 0, Errors: 0, Skipped: 0, Time elapsed: 4.418 sec - in org.apache.hadoop.hdfs.util.TestByteArrayManager
Running org.apache.hadoop.hdfs.util.TestLightWeightLinkedSet
Tests run: 17, Failures: 0, Errors: 0, Skipped: 0, Time elapsed: 0.23 sec - in org.apache.hadoop.hdfs.util.TestLightWeightLinkedSet
Running org.apache.hadoop.hdfs.util.TestMD5FileUtils
Tests run: 5, Failures: 0, Errors: 0, Skipped: 0, Time elapsed: 0.321 sec - in org.apache.hadoop.hdfs.util.TestMD5FileUtils
Running org.apache.hadoop.hdfs.util.TestExactSizeInputStream
Tests run: 7, Failures: 0, Errors: 0, Skipped: 0, Time elapsed: 0.087 sec - in org.apache.hadoop.hdfs.util.TestExactSizeInputStream
Running org.apache.hadoop.hdfs.util.TestAtomicFileOutputStream
Tests run: 4, Failures: 0, Errors: 0, Skipped: 1, Time elapsed: 0.252 sec - in org.apache.hadoop.hdfs.util.TestAtomicFileOutputStream
Running org.apache.hadoop.hdfs.util.TestXMLUtils
Tests run: 6, Failures: 0, Errors: 0, Skipped: 0, Time elapsed: 0.085 sec - in org.apache.hadoop.hdfs.util.TestXMLUtils
Running org.apache.hadoop.hdfs.util.TestLightWeightHashSet
Tests run: 13, Failures: 0, Errors: 0, Skipped: 0, Time elapsed: 0.22 sec - in org.apache.hadoop.hdfs.util.TestLightWeightHashSet
Running org.apache.hadoop.hdfs.util.TestCyclicIteration
Tests run: 1, Failures: 0, Errors: 0, Skipped: 0, Time elapsed: 0.084 sec - in org.apache.hadoop.hdfs.util.TestCyclicIteration
Running org.apache.hadoop.hdfs.util.TestDiff
Tests run: 1, Failures: 0, Errors: 0, Skipped: 0, Time elapsed: 2.989 sec - in org.apache.hadoop.hdfs.util.TestDiff
Running org.apache.hadoop.hdfs.TestRemoteBlockReader
Tests run: 1, Failures: 0, Errors: 0, Skipped: 0, Time elapsed: 4.613 sec - in org.apache.hadoop.hdfs.TestRemoteBlockReader
Running org.apache.hadoop.hdfs.TestDFSStartupVersions
Tests run: 1, Failures: 0, Errors: 0, Skipped: 0, Time elapsed: 11.239 sec - in org.apache.hadoop.hdfs.TestDFSStartupVersions
Running org.apache.hadoop.hdfs.TestWriteBlockGetsBlockLengthHint
Tests run: 1, Failures: 0, Errors: 0, Skipped: 0, Time elapsed: 4.224 sec - in org.apache.hadoop.hdfs.TestWriteBlockGetsBlockLengthHint
Running org.apache.hadoop.hdfs.TestReservedRawPaths
Tests run: 8, Failures: 0, Errors: 0, Skipped: 0, Time elapsed: 9.614 sec - in org.apache.hadoop.hdfs.TestReservedRawPaths
Running org.apache.hadoop.hdfs.TestRead
Tests run: 3, Failures: 0, Errors: 0, Skipped: 0, Time elapsed: 6.512 sec - in org.apache.hadoop.hdfs.TestRead
Running org.apache.hadoop.hdfs.TestAppendDifferentChecksum
Tests run: 3, Failures: 0, Errors: 0, Skipped: 1, Time elapsed: 9.079 sec - in org.apache.hadoop.hdfs.TestAppendDifferentChecksum
Running org.apache.hadoop.hdfs.TestDFSRollback
Tests run: 1, Failures: 0, Errors: 0, Skipped: 0, Time elapsed: 14.018 sec - in org.apache.hadoop.hdfs.TestDFSRollback
Running org.apache.hadoop.hdfs.TestMiniDFSCluster
Tests run: 6, Failures: 0, Errors: 0, Skipped: 0, Time elapsed: 9.326 sec - in org.apache.hadoop.hdfs.TestMiniDFSCluster
Running org.apache.hadoop.hdfs.TestClientReportBadBlock
Tests run: 3, Failures: 0, Errors: 0, Skipped: 0, Time elapsed: 8.76 sec - in org.apache.hadoop.hdfs.TestClientReportBadBlock
Running org.apache.hadoop.hdfs.TestLeaseRecovery2
Tests run: 7, Failures: 0, Errors: 0, Skipped: 0, Time elapsed: 180.11 sec - in org.apache.hadoop.hdfs.TestLeaseRecovery2
Running org.apache.hadoop.hdfs.protocol.TestLayoutVersion
Tests run: 7, Failures: 0, Errors: 0, Skipped: 0, Time elapsed: 0.111 sec - in org.apache.hadoop.hdfs.protocol.TestLayoutVersion
Running org.apache.hadoop.hdfs.protocol.datatransfer.TestPacketReceiver
Tests run: 1, Failures: 0, Errors: 0, Skipped: 0, Time elapsed: 0.436 sec - in org.apache.hadoop.hdfs.protocol.datatransfer.TestPacketReceiver
Running org.apache.hadoop.hdfs.protocol.datatransfer.sasl.TestSaslDataTransfer
Tests run: 8, Failures: 0, Errors: 0, Skipped: 0, Time elapsed: 23.993 sec - in org.apache.hadoop.hdfs.protocol.datatransfer.sasl.TestSaslDataTransfer
Running org.apache.hadoop.hdfs.protocol.TestAnnotations
Tests run: 1, Failures: 0, Errors: 0, Skipped: 0, Time elapsed: 0.178 sec - in org.apache.hadoop.hdfs.protocol.TestAnnotations
Running org.apache.hadoop.hdfs.protocol.TestBlockListAsLongs
Tests run: 6, Failures: 0, Errors: 0, Skipped: 0, Time elapsed: 1.09 sec - in org.apache.hadoop.hdfs.protocol.TestBlockListAsLongs
Running org.apache.hadoop.hdfs.protocol.TestExtendedBlock
Tests run: 2, Failures: 0, Errors: 0, Skipped: 0, Time elapsed: 0.088 sec - in org.apache.hadoop.hdfs.protocol.TestExtendedBlock
Running org.apache.hadoop.hdfs.TestAbandonBlock
Tests run: 2, Failures: 0, Errors: 0, Skipped: 0, Time elapsed: 10.293 sec - in org.apache.hadoop.hdfs.TestAbandonBlock
Running org.apache.hadoop.hdfs.crypto.TestHdfsCryptoStreams
Tests run: 14, Failures: 0, Errors: 0, Skipped: 0, Time elapsed: 25.885 sec - in org.apache.hadoop.hdfs.crypto.TestHdfsCryptoStreams
Running org.apache.hadoop.hdfs.TestFileAppendRestart
Tests run: 3, Failures: 0, Errors: 0, Skipped: 0, Time elapsed: 14.538 sec - in org.apache.hadoop.hdfs.TestFileAppendRestart
Running org.apache.hadoop.hdfs.TestFetchImage
Tests run: 1, Failures: 0, Errors: 0, Skipped: 0, Time elapsed: 3.969 sec - in org.apache.hadoop.hdfs.TestFetchImage
Running org.apache.hadoop.hdfs.TestFileCreationDelete
Tests run: 1, Failures: 0, Errors: 0, Skipped: 0, Time elapsed: 14.785 sec - in org.apache.hadoop.hdfs.TestFileCreationDelete
Running org.apache.hadoop.hdfs.TestCrcCorruption
Tests run: 4, Failures: 0, Errors: 0, Skipped: 0, Time elapsed: 16.58 sec - in org.apache.hadoop.hdfs.TestCrcCorruption
Running org.apache.hadoop.hdfs.TestHDFSFileSystemContract
Tests run: 44, Failures: 0, Errors: 0, Skipped: 0, Time elapsed: 53.35 sec - in org.apache.hadoop.hdfs.TestHDFSFileSystemContract
Running org.apache.hadoop.hdfs.TestBlockStoragePolicy
Tests run: 17, Failures: 0, Errors: 0, Skipped: 0, Time elapsed: 38.144 sec - in org.apache.hadoop.hdfs.TestBlockStoragePolicy
Running org.apache.hadoop.hdfs.TestDatanodeDeath
Tests run: 4, Failures: 0, Errors: 0, Skipped: 0, Time elapsed: 157.594 sec - in org.apache.hadoop.hdfs.TestDatanodeDeath
Running org.apache.hadoop.hdfs.TestParallelReadUtil
Tests run: 1, Failures: 0, Errors: 0, Skipped: 1, Time elapsed: 0.039 sec - in org.apache.hadoop.hdfs.TestParallelReadUtil
Running org.apache.hadoop.hdfs.TestDFSUpgrade
Tests run: 3, Failures: 0, Errors: 0, Skipped: 0, Time elapsed: 14.406 sec - in org.apache.hadoop.hdfs.TestDFSUpgrade
Running org.apache.hadoop.hdfs.TestDFSShell
Tests run: 31, Failures: 0, Errors: 0, Skipped: 0, Time elapsed: 30.372 sec - in org.apache.hadoop.hdfs.TestDFSShell
Running org.apache.hadoop.hdfs.TestFileAppend2
Tests run: 4, Failures: 0, Errors: 0, Skipped: 0, Time elapsed: 23.825 sec - in org.apache.hadoop.hdfs.TestFileAppend2
Running org.apache.hadoop.hdfs.TestKeyProviderCache
Tests run: 1, Failures: 0, Errors: 0, Skipped: 0, Time elapsed: 0.573 sec - in org.apache.hadoop.hdfs.TestKeyProviderCache
Running org.apache.hadoop.hdfs.TestListFilesInDFS
Tests run: 2, Failures: 0, Errors: 0, Skipped: 0, Time elapsed: 4.673 sec - in org.apache.hadoop.hdfs.TestListFilesInDFS
Running org.apache.hadoop.hdfs.TestAppendSnapshotTruncate
Tests run: 1, Failures: 0, Errors: 0, Skipped: 0, Time elapsed: 15.961 sec - in org.apache.hadoop.hdfs.TestAppendSnapshotTruncate
Running org.apache.hadoop.hdfs.TestDFSOutputStream
Tests run: 3, Failures: 0, Errors: 0, Skipped: 0, Time elapsed: 6.177 sec - in org.apache.hadoop.hdfs.TestDFSOutputStream
Running org.apache.hadoop.hdfs.TestHDFSServerPorts
Tests run: 4, Failures: 0, Errors: 0, Skipped: 0, Time elapsed: 6.852 sec - in org.apache.hadoop.hdfs.TestHDFSServerPorts
Running org.apache.hadoop.hdfs.TestDFSPacket
Tests run: 2, Failures: 0, Errors: 0, Skipped: 0, Time elapsed: 0.121 sec - in org.apache.hadoop.hdfs.TestDFSPacket
Running org.apache.hadoop.hdfs.TestDFSClientExcludedNodes
Tests run: 2, Failures: 0, Errors: 0, Skipped: 0, Time elapsed: 11.839 sec - in org.apache.hadoop.hdfs.TestDFSClientExcludedNodes
Running org.apache.hadoop.hdfs.TestDFSPermission
Tests run: 7, Failures: 0, Errors: 0, Skipped: 0, Time elapsed: 20.255 sec - in org.apache.hadoop.hdfs.TestDFSPermission
Running org.apache.hadoop.hdfs.TestRestartDFS
Tests run: 2, Failures: 0, Errors: 0, Skipped: 0, Time elapsed: 13.329 sec - in org.apache.hadoop.hdfs.TestRestartDFS
Running org.apache.hadoop.cli.TestCryptoAdminCLI
Tests run: 1, Failures: 0, Errors: 0, Skipped: 0, Time elapsed: 7.659 sec - in org.apache.hadoop.cli.TestCryptoAdminCLI
Running org.apache.hadoop.cli.TestHDFSCLI
Tests run: 1, Failures: 0, Errors: 0, Skipped: 0, Time elapsed: 64.781 sec - in org.apache.hadoop.cli.TestHDFSCLI
Running org.apache.hadoop.cli.TestAclCLI
Tests run: 1, Failures: 0, Errors: 0, Skipped: 0, Time elapsed: 6.883 sec - in org.apache.hadoop.cli.TestAclCLI
Running org.apache.hadoop.cli.TestCacheAdminCLI
Tests run: 1, Failures: 0, Errors: 0, Skipped: 0, Time elapsed: 6.636 sec - in org.apache.hadoop.cli.TestCacheAdminCLI
Running org.apache.hadoop.cli.TestXAttrCLI
Tests run: 1, Failures: 0, Errors: 0, Skipped: 0, Time elapsed: 7.89 sec - in org.apache.hadoop.cli.TestXAttrCLI
Running org.apache.hadoop.TestRefreshCallQueue
Tests run: 1, Failures: 0, Errors: 0, Skipped: 0, Time elapsed: 3.981 sec - in org.apache.hadoop.TestRefreshCallQueue
Running org.apache.hadoop.security.TestPermissionSymlinks
Tests run: 15, Failures: 0, Errors: 0, Skipped: 0, Time elapsed: 5.476 sec - in org.apache.hadoop.security.TestPermissionSymlinks
Running org.apache.hadoop.security.TestPermission
Tests run: 3, Failures: 0, Errors: 0, Skipped: 0, Time elapsed: 5.978 sec - in org.apache.hadoop.security.TestPermission
Running org.apache.hadoop.security.TestRefreshUserMappings
Tests run: 2, Failures: 0, Errors: 0, Skipped: 0, Time elapsed: 5.758 sec - in org.apache.hadoop.security.TestRefreshUserMappings

Results :

Tests in error: 
  TestViewFileSystemWithXAttrs.clusterSetupAtBeginning:62 ยป NoClassDefFound org/...
  TestViewFileSystemWithXAttrs.ClusterShutdownAtEnd:74 NullPointer

Tests run: 3426, Failures: 0, Errors: 2, Skipped: 17

[INFO]                                                                         
[INFO] ------------------------------------------------------------------------
[INFO] Skipping Apache Hadoop HttpFS
[INFO] This project has been banned from the build due to previous failures.
[INFO] ------------------------------------------------------------------------
[INFO]                                                                         
[INFO] ------------------------------------------------------------------------
[INFO] Skipping Apache Hadoop HDFS BookKeeper Journal
[INFO] This project has been banned from the build due to previous failures.
[INFO] ------------------------------------------------------------------------
[INFO]                                                                         
[INFO] ------------------------------------------------------------------------
[INFO] Skipping Apache Hadoop HDFS-NFS
[INFO] This project has been banned from the build due to previous failures.
[INFO] ------------------------------------------------------------------------
[INFO]                                                                         
[INFO] ------------------------------------------------------------------------
[INFO] Building Apache Hadoop HDFS Project 3.0.0-SNAPSHOT
[INFO] ------------------------------------------------------------------------
[INFO] 
[INFO] --- maven-clean-plugin:2.5:clean (default-clean) @ hadoop-hdfs-project ---
[INFO] Deleting <https://builds.apache.org/job/Hadoop-Hdfs-trunk/ws/hadoop-hdfs-project/target>
[INFO] 
[INFO] --- maven-antrun-plugin:1.7:run (create-testdirs) @ hadoop-hdfs-project ---
[INFO] Executing tasks

main:
    [mkdir] Created dir: <https://builds.apache.org/job/Hadoop-Hdfs-trunk/ws/hadoop-hdfs-project/target/test-dir>
[INFO] Executed tasks
[INFO] 
[INFO] --- maven-source-plugin:2.3:jar-no-fork (hadoop-java-sources) @ hadoop-hdfs-project
---
[INFO] 
[INFO] --- maven-source-plugin:2.3:test-jar-no-fork (hadoop-java-sources) @ hadoop-hdfs-project
---
[INFO] 
[INFO] --- maven-enforcer-plugin:1.3.1:enforce (dist-enforce) @ hadoop-hdfs-project ---
[INFO] 
[INFO] --- maven-site-plugin:3.4:attach-descriptor (attach-descriptor) @ hadoop-hdfs-project
---
[INFO] 
[INFO] --- maven-javadoc-plugin:2.8.1:jar (module-javadocs) @ hadoop-hdfs-project ---
[INFO] Skipping javadoc generation
[INFO] 
[INFO] --- maven-enforcer-plugin:1.3.1:enforce (depcheck) @ hadoop-hdfs-project ---
[INFO] 
[INFO] --- maven-checkstyle-plugin:2.15:checkstyle (default-cli) @ hadoop-hdfs-project ---
[INFO] 
[INFO] --- findbugs-maven-plugin:3.0.0:findbugs (default-cli) @ hadoop-hdfs-project ---
[INFO] ------------------------------------------------------------------------
[INFO] Reactor Summary:
[INFO] 
[INFO] Apache Hadoop HDFS Client ......................... SUCCESS [ 46.532 s]
[INFO] Apache Hadoop HDFS ................................ FAILURE [  02:48 h]
[INFO] Apache Hadoop HttpFS .............................. SKIPPED
[INFO] Apache Hadoop HDFS BookKeeper Journal ............. SKIPPED
[INFO] Apache Hadoop HDFS-NFS ............................ SKIPPED
[INFO] Apache Hadoop HDFS Project ........................ SUCCESS [  0.054 s]
[INFO] ------------------------------------------------------------------------
[INFO] BUILD FAILURE
[INFO] ------------------------------------------------------------------------
[INFO] Total time: 02:49 h
[INFO] Finished at: 2015-05-15T14:30:17+00:00
[INFO] Final Memory: 52M/695M
[INFO] ------------------------------------------------------------------------
[ERROR] Failed to execute goal org.apache.maven.plugins:maven-surefire-plugin:2.17:test (default-test)
on project hadoop-hdfs: There are test failures.
[ERROR] 
[ERROR] Please refer to <https://builds.apache.org/job/Hadoop-Hdfs-trunk/ws/hadoop-hdfs-project/hadoop-hdfs/target/surefire-reports>
for the individual test results.
[ERROR] -> [Help 1]
[ERROR] 
[ERROR] To see the full stack trace of the errors, re-run Maven with the -e switch.
[ERROR] Re-run Maven using the -X switch to enable full debug logging.
[ERROR] 
[ERROR] For more information about the errors and possible solutions, please read the following
articles:
[ERROR] [Help 1] http://cwiki.apache.org/confluence/display/MAVEN/MojoFailureException
[ERROR] 
[ERROR] After correcting the problems, you can resume the build with the command
[ERROR]   mvn <goals> -rf :hadoop-hdfs
Build step 'Execute shell' marked build as failure
Archiving artifacts
Sending artifact delta relative to Hadoop-Hdfs-trunk #2116
Archived 1 artifacts
Archive block size is 32768
Received 0 blocks and 363010 bytes
Compression is 0.0%
Took 12 sec
Recording test results
Updating MAPREDUCE-5708
Updating HDFS-8371
Updating HADOOP-11713
Updating YARN-3505
Updating HADOOP-11960
Updating HDFS-8350
Updating HDFS-6888
Updating MAPREDUCE-6273
Updating YARN-1519

Mime
View raw message