hadoop-hdfs-dev mailing list archives

Site index · List index
Message view « Date » · « Thread »
Top « Date » · « Thread »
From Apache Jenkins Server <jenk...@builds.apache.org>
Subject Hadoop-Hdfs-trunk - Build # 2138 - Still Failing
Date Wed, 27 May 2015 14:25:35 GMT
See https://builds.apache.org/job/Hadoop-Hdfs-trunk/2138/

###################################################################################
########################## LAST 60 LINES OF THE CONSOLE ###########################
[...truncated 6849 lines...]
[INFO] --- maven-enforcer-plugin:1.3.1:enforce (dist-enforce) @ hadoop-hdfs-project ---
[INFO] 
[INFO] --- maven-site-plugin:3.4:attach-descriptor (attach-descriptor) @ hadoop-hdfs-project
---
[INFO] 
[INFO] --- maven-javadoc-plugin:2.8.1:jar (module-javadocs) @ hadoop-hdfs-project ---
[INFO] Skipping javadoc generation
[INFO] 
[INFO] --- maven-enforcer-plugin:1.3.1:enforce (depcheck) @ hadoop-hdfs-project ---
[INFO] 
[INFO] --- maven-checkstyle-plugin:2.15:checkstyle (default-cli) @ hadoop-hdfs-project ---
[INFO] 
[INFO] --- findbugs-maven-plugin:3.0.0:findbugs (default-cli) @ hadoop-hdfs-project ---
[INFO] ------------------------------------------------------------------------
[INFO] Reactor Summary:
[INFO] 
[INFO] Apache Hadoop HDFS Client ......................... SUCCESS [ 46.692 s]
[INFO] Apache Hadoop HDFS ................................ FAILURE [  02:42 h]
[INFO] Apache Hadoop HttpFS .............................. SKIPPED
[INFO] Apache Hadoop HDFS BookKeeper Journal ............. SKIPPED
[INFO] Apache Hadoop HDFS-NFS ............................ SKIPPED
[INFO] Apache Hadoop HDFS Project ........................ SUCCESS [  0.056 s]
[INFO] ------------------------------------------------------------------------
[INFO] BUILD FAILURE
[INFO] ------------------------------------------------------------------------
[INFO] Total time: 02:43 h
[INFO] Finished at: 2015-05-27T14:24:57+00:00
[INFO] Final Memory: 55M/705M
[INFO] ------------------------------------------------------------------------
[ERROR] Failed to execute goal org.apache.maven.plugins:maven-surefire-plugin:2.17:test (default-test)
on project hadoop-hdfs: There are test failures.
[ERROR] 
[ERROR] Please refer to /home/jenkins/jenkins-slave/workspace/Hadoop-Hdfs-trunk/hadoop-hdfs-project/hadoop-hdfs/target/surefire-reports
for the individual test results.
[ERROR] -> [Help 1]
[ERROR] 
[ERROR] To see the full stack trace of the errors, re-run Maven with the -e switch.
[ERROR] Re-run Maven using the -X switch to enable full debug logging.
[ERROR] 
[ERROR] For more information about the errors and possible solutions, please read the following
articles:
[ERROR] [Help 1] http://cwiki.apache.org/confluence/display/MAVEN/MojoFailureException
[ERROR] 
[ERROR] After correcting the problems, you can resume the build with the command
[ERROR]   mvn <goals> -rf :hadoop-hdfs
Build step 'Execute shell' marked build as failure
Archiving artifacts
Sending artifact delta relative to Hadoop-Hdfs-trunk #2116
Archived 1 artifacts
Archive block size is 32768
Received 0 blocks and 362660 bytes
Compression is 0.0%
Took 11 sec
Recording test results
Updating YARN-3686
Updating HADOOP-11242
Updating YARN-160
Updating HADOOP-11969
Updating YARN-3632
Updating MAPREDUCE-6364
Sending e-mails to: hdfs-dev@hadoop.apache.org
Email was triggered for: Failure
Sending email for trigger: Failure



###################################################################################
############################## FAILED TESTS (if any) ##############################
1 tests failed.
REGRESSION:  org.apache.hadoop.hdfs.server.namenode.ha.TestDFSUpgradeWithHA.testFinalizeWithJournalNodes

Error Message:
java.lang.RuntimeException: java.net.SocketTimeoutException: Read timed out

Stack Trace:
java.io.IOException: java.lang.RuntimeException: java.net.SocketTimeoutException: Read timed
out
	at java.net.SocketInputStream.socketRead0(Native Method)
	at java.net.SocketInputStream.read(SocketInputStream.java:152)
	at java.net.SocketInputStream.read(SocketInputStream.java:122)
	at java.io.BufferedInputStream.fill(BufferedInputStream.java:235)
	at java.io.BufferedInputStream.read1(BufferedInputStream.java:275)
	at java.io.BufferedInputStream.read(BufferedInputStream.java:334)
	at sun.net.www.http.HttpClient.parseHTTPHeader(HttpClient.java:687)
	at sun.net.www.http.HttpClient.parseHTTP(HttpClient.java:633)
	at sun.net.www.protocol.http.HttpURLConnection.getInputStream(HttpURLConnection.java:1323)
	at java.net.HttpURLConnection.getResponseCode(HttpURLConnection.java:468)
	at org.apache.hadoop.hdfs.server.namenode.TransferFsImage.doGetUrl(TransferFsImage.java:414)
	at org.apache.hadoop.hdfs.server.namenode.TransferFsImage.getFileClient(TransferFsImage.java:399)
	at org.apache.hadoop.hdfs.server.namenode.TransferFsImage.downloadImageToStorage(TransferFsImage.java:116)
	at org.apache.hadoop.hdfs.server.namenode.ha.BootstrapStandby.downloadImage(BootstrapStandby.java:318)
	at org.apache.hadoop.hdfs.server.namenode.ha.BootstrapStandby.doRun(BootstrapStandby.java:204)
	at org.apache.hadoop.hdfs.server.namenode.ha.BootstrapStandby.access$000(BootstrapStandby.java:76)
	at org.apache.hadoop.hdfs.server.namenode.ha.BootstrapStandby$1.run(BootstrapStandby.java:114)
	at org.apache.hadoop.hdfs.server.namenode.ha.BootstrapStandby$1.run(BootstrapStandby.java:110)
	at org.apache.hadoop.security.SecurityUtil.doAsLoginUserOrFatal(SecurityUtil.java:415)
	at org.apache.hadoop.hdfs.server.namenode.ha.BootstrapStandby.run(BootstrapStandby.java:110)
	at org.apache.hadoop.util.ToolRunner.run(ToolRunner.java:70)
	at org.apache.hadoop.util.ToolRunner.run(ToolRunner.java:84)
	at org.apache.hadoop.hdfs.server.namenode.ha.BootstrapStandby.run(BootstrapStandby.java:421)
	at org.apache.hadoop.hdfs.server.namenode.ha.TestDFSUpgradeWithHA.testFinalizeWithJournalNodes(TestDFSUpgradeWithHA.java:428)



Mime
  • Unnamed multipart/mixed (inline, None, 0 bytes)
View raw message