hadoop-hdfs-dev mailing list archives

Site index · List index
Message view « Date » · « Thread »
Top « Date » · « Thread »
From Apache Jenkins Server <jenk...@builds.apache.org>
Subject Hadoop-Hdfs-trunk-Java8 - Build # 143 - Still Failing
Date Fri, 03 Apr 2015 14:42:04 GMT
See https://builds.apache.org/job/Hadoop-Hdfs-trunk-Java8/143/

###################################################################################
########################## LAST 60 LINES OF THE CONSOLE ###########################
[...truncated 7261 lines...]
[INFO] Not executing Javadoc as the project is not a Java classpath-capable package
[INFO] 
[INFO] --- maven-enforcer-plugin:1.3.1:enforce (depcheck) @ hadoop-hdfs-project ---
[INFO] 
[INFO] --- maven-checkstyle-plugin:2.12.1:checkstyle (default-cli) @ hadoop-hdfs-project ---
[INFO] 
[INFO] --- findbugs-maven-plugin:3.0.0:findbugs (default-cli) @ hadoop-hdfs-project ---
[INFO] ------------------------------------------------------------------------
[INFO] Reactor Summary:
[INFO] 
[INFO] Apache Hadoop HDFS Client ......................... SUCCESS [  5.212 s]
[INFO] Apache Hadoop HDFS ................................ FAILURE [  03:06 h]
[INFO] Apache Hadoop HttpFS .............................. SKIPPED
[INFO] Apache Hadoop HDFS BookKeeper Journal ............. SKIPPED
[INFO] Apache Hadoop HDFS-NFS ............................ SKIPPED
[INFO] Apache Hadoop HDFS Project ........................ SUCCESS [  0.092 s]
[INFO] ------------------------------------------------------------------------
[INFO] BUILD FAILURE
[INFO] ------------------------------------------------------------------------
[INFO] Total time: 03:06 h
[INFO] Finished at: 2015-04-03T14:41:21+00:00
[INFO] Final Memory: 47M/262M
[INFO] ------------------------------------------------------------------------
[ERROR] Failed to execute goal org.apache.maven.plugins:maven-surefire-plugin:2.17:test (default-test)
on project hadoop-hdfs: There are test failures.
[ERROR] 
[ERROR] Please refer to /home/jenkins/jenkins-slave/workspace/Hadoop-Hdfs-trunk-Java8/hadoop-hdfs-project/hadoop-hdfs/target/surefire-reports
for the individual test results.
[ERROR] -> [Help 1]
[ERROR] 
[ERROR] To see the full stack trace of the errors, re-run Maven with the -e switch.
[ERROR] Re-run Maven using the -X switch to enable full debug logging.
[ERROR] 
[ERROR] For more information about the errors and possible solutions, please read the following
articles:
[ERROR] [Help 1] http://cwiki.apache.org/confluence/display/MAVEN/MojoFailureException
[ERROR] 
[ERROR] After correcting the problems, you can resume the build with the command
[ERROR]   mvn <goals> -rf :hadoop-hdfs
Build step 'Execute shell' marked build as failure
Archiving artifacts
Sending artifact delta relative to Hadoop-Hdfs-trunk-Java8 #136
Archived 1 artifacts
Archive block size is 32768
Received 0 blocks and 1722 bytes
Compression is 0.0%
Took 14 sec
Recording test results
Updating YARN-2901
Updating HDFS-7954
Updating YARN-3365
Updating HDFS-7811
Updating HDFS-7888
Updating HADOOP-11797
Updating HADOOP-9805
Updating HDFS-7893
Updating YARN-3415
Updating MAPREDUCE-6303
Updating HDFS-8035
Sending e-mails to: hdfs-dev@hadoop.apache.org
Email was triggered for: Failure
Sending email for trigger: Failure



###################################################################################
############################## FAILED TESTS (if any) ##############################
2 tests failed.
FAILED:  org.apache.hadoop.hdfs.server.blockmanagement.TestDatanodeManager.testNumVersionsReportedCorrect

Error Message:
The map of version counts returned by DatanodeManager was not what it was expected to be on
iteration 430 expected:<0> but was:<1>

Stack Trace:
java.lang.AssertionError: The map of version counts returned by DatanodeManager was not what
it was expected to be on iteration 430 expected:<0> but was:<1>
	at org.junit.Assert.fail(Assert.java:88)
	at org.junit.Assert.failNotEquals(Assert.java:743)
	at org.junit.Assert.assertEquals(Assert.java:118)
	at org.junit.Assert.assertEquals(Assert.java:555)
	at org.apache.hadoop.hdfs.server.blockmanagement.TestDatanodeManager.testNumVersionsReportedCorrect(TestDatanodeManager.java:157)


REGRESSION:  org.apache.hadoop.hdfs.server.namenode.ha.TestRetryCacheWithHA.testUpdatePipeline

Error Message:
After waiting the operation updatePipeline still has not taken effect on NN yet

Stack Trace:
java.lang.AssertionError: After waiting the operation updatePipeline still has not taken effect
on NN yet
	at org.junit.Assert.fail(Assert.java:88)
	at org.junit.Assert.assertTrue(Assert.java:41)
	at org.apache.hadoop.hdfs.server.namenode.ha.TestRetryCacheWithHA.testClientRetryWithFailover(TestRetryCacheWithHA.java:1280)
	at org.apache.hadoop.hdfs.server.namenode.ha.TestRetryCacheWithHA.testUpdatePipeline(TestRetryCacheWithHA.java:1178)



Mime
  • Unnamed multipart/mixed (inline, None, 0 bytes)
View raw message