hadoop-hdfs-dev mailing list archives

Site index · List index
Message view « Date » · « Thread »
Top « Date » · « Thread »
From Apache Jenkins Server <jenk...@builds.apache.org>
Subject Hadoop-Hdfs-trunk - Build # 2106 - Still Failing
Date Sat, 25 Apr 2015 11:34:47 GMT
See https://builds.apache.org/job/Hadoop-Hdfs-trunk/2106/

###################################################################################
########################## LAST 60 LINES OF THE CONSOLE ###########################
[...truncated 5193 lines...]
[INFO] 
[INFO] --- maven-enforcer-plugin:1.3.1:enforce (depcheck) @ hadoop-hdfs-project ---
[INFO] 
[INFO] --- maven-checkstyle-plugin:2.12.1:checkstyle (default-cli) @ hadoop-hdfs-project ---
[INFO] 
[INFO] --- findbugs-maven-plugin:3.0.0:findbugs (default-cli) @ hadoop-hdfs-project ---
[INFO] ------------------------------------------------------------------------
[INFO] Reactor Summary:
[INFO] 
[INFO] Apache Hadoop HDFS Client ......................... FAILURE [ 25.607 s]
[INFO] Apache Hadoop HDFS ................................ SKIPPED
[INFO] Apache Hadoop HttpFS .............................. SKIPPED
[INFO] Apache Hadoop HDFS BookKeeper Journal ............. SKIPPED
[INFO] Apache Hadoop HDFS-NFS ............................ SKIPPED
[INFO] Apache Hadoop HDFS Project ........................ SUCCESS [  0.118 s]
[INFO] ------------------------------------------------------------------------
[INFO] BUILD FAILURE
[INFO] ------------------------------------------------------------------------
[INFO] Total time: 27.151 s
[INFO] Finished at: 2015-04-25T11:34:31+00:00
[INFO] Final Memory: 55M/723M
[INFO] ------------------------------------------------------------------------
[ERROR] Failed to execute goal org.apache.maven.plugins:maven-checkstyle-plugin:2.12.1:checkstyle
(default-cli) on project hadoop-hdfs-client: An error has occurred in Checkstyle report generation.
Failed during checkstyle execution: Unable to find configuration file at location: file:///home/jenkins/jenkins-slave/workspace/Hadoop-Hdfs-trunk/hadoop-hdfs-project/hadoop-hdfs-client/dev-support/checkstyle.xml:
Could not find resource 'file:///home/jenkins/jenkins-slave/workspace/Hadoop-Hdfs-trunk/hadoop-hdfs-project/hadoop-hdfs-client/dev-support/checkstyle.xml'.
-> [Help 1]
[ERROR] 
[ERROR] To see the full stack trace of the errors, re-run Maven with the -e switch.
[ERROR] Re-run Maven using the -X switch to enable full debug logging.
[ERROR] 
[ERROR] For more information about the errors and possible solutions, please read the following
articles:
[ERROR] [Help 1] http://cwiki.apache.org/confluence/display/MAVEN/MojoExecutionException
Build step 'Execute shell' marked build as failure
Archiving artifacts
Sending artifact delta relative to Hadoop-Hdfs-trunk #2088
Archived 1 artifacts
Archive block size is 32768
Received 0 blocks and 315329 bytes
Compression is 0.0%
Took 5.1 sec
Recording test results
Updating YARN-3387
Updating YARN-3444
Updating HDFS-8211
Updating YARN-2498
Updating YARN-3537
Updating MAPREDUCE-6238
Updating YARN-3472
Updating MAPREDUCE-6297
Updating YARN-3382
Updating HADOOP-11876
Updating MAPREDUCE-6333
Updating YARN-3351
Updating YARN-3406
Updating HDFS-8176
Updating HADOOP-11843
Updating HDFS-8191
Updating HDFS-8110
Updating YARN-3511
Sending e-mails to: hdfs-dev@hadoop.apache.org
Email was triggered for: Failure
Sending email for trigger: Failure



###################################################################################
############################## FAILED TESTS (if any) ##############################
No tests ran.
Mime
  • Unnamed multipart/mixed (inline, None, 0 bytes)
View raw message