hadoop-hdfs-dev mailing list archives

Site index · List index
Message view « Date » · « Thread »
Top « Date » · « Thread »
From Apache Jenkins Server <jenk...@builds.apache.org>
Subject Build failed in Jenkins: Hadoop-Hdfs-trunk #2084
Date Fri, 03 Apr 2015 14:46:21 GMT
See <https://builds.apache.org/job/Hadoop-Hdfs-trunk/2084/changes>

Changes:

[szetszwo] HDFS-7888. Change DFSOutputStream and DataStreamer for convenience of subclassing.
Contributed by Li Bo

[szetszwo] HDFS-7954. TestBalancer#testBalancerWithPinnedBlocks should not be executed on
Windows.  Contributed by Xiaoyu Yao

[wheat9] HDFS-8035. Move checkBlocksProperlyReplicated() in FSNamesystem to BlockManager.
Contributed by Haohui Mai.

[junping_du] MAPREDUCE-6303. Read timeout when retrying a fetch error can be fatal to a reducer.
Contributed by Jason Lowe.

[sandy] YARN-3415. Non-AM containers can be counted towards amResourceUsage of a fairscheduler
queue (Zhihai Xu via Sandy Ryza)

[wheat9] HDFS-7893. Update the POM to create a separate hdfs-client jar. Contributed by Haohui
Mai.

[cnauroth] HADOOP-9805. Refactor RawLocalFileSystem#rename for improved testability. Contributed
by Jean-Pierre Matsumoto.

[vinodkv] YARN-3365. Enhanced NodeManager to support using the 'tc' tool via container-executor
for outbound network traffic control. Contributed by Sidharta Seethana.

[wangda] YARN-2901. Add errors and warning metrics page to RM, NM web UI. (Varun Vasudev via
wangda)

[aw] HADOOP-11797. releasedocmaker.py needs to put ASF headers on output (aw)

[jing9] HDFS-7811. Avoid recursive call getStoragePolicyID in INodeFile#computeQuotaUsage.
Contributed by Xiaoyu Yao and Jing Zhao.

------------------------------------------
[...truncated 7362 lines...]
Running org.apache.hadoop.hdfs.TestDFSAddressConfig
Tests run: 1, Failures: 0, Errors: 0, Skipped: 0, Time elapsed: 4.726 sec - in org.apache.hadoop.hdfs.TestDFSAddressConfig
Running org.apache.hadoop.hdfs.TestParallelShortCircuitLegacyRead
Tests run: 4, Failures: 0, Errors: 0, Skipped: 0, Time elapsed: 14.721 sec - in org.apache.hadoop.hdfs.TestParallelShortCircuitLegacyRead
Running org.apache.hadoop.hdfs.TestLargeBlock
Tests run: 1, Failures: 0, Errors: 0, Skipped: 0, Time elapsed: 14.14 sec - in org.apache.hadoop.hdfs.TestLargeBlock
Running org.apache.hadoop.hdfs.TestHDFSTrash
Tests run: 2, Failures: 0, Errors: 0, Skipped: 0, Time elapsed: 9.476 sec - in org.apache.hadoop.hdfs.TestHDFSTrash
Running org.apache.hadoop.hdfs.TestClientReportBadBlock
Tests run: 3, Failures: 0, Errors: 0, Skipped: 0, Time elapsed: 8.138 sec - in org.apache.hadoop.hdfs.TestClientReportBadBlock
Running org.apache.hadoop.hdfs.TestWriteRead
Tests run: 3, Failures: 0, Errors: 0, Skipped: 0, Time elapsed: 26.737 sec - in org.apache.hadoop.hdfs.TestWriteRead
Running org.apache.hadoop.hdfs.TestClientProtocolForPipelineRecovery
Tests run: 4, Failures: 0, Errors: 0, Skipped: 0, Time elapsed: 34.09 sec - in org.apache.hadoop.hdfs.TestClientProtocolForPipelineRecovery
Running org.apache.hadoop.hdfs.TestBalancerBandwidth
Tests run: 1, Failures: 0, Errors: 0, Skipped: 0, Time elapsed: 13.822 sec - in org.apache.hadoop.hdfs.TestBalancerBandwidth
Running org.apache.hadoop.hdfs.TestDFSUpgrade
Tests run: 3, Failures: 0, Errors: 0, Skipped: 0, Time elapsed: 13.955 sec - in org.apache.hadoop.hdfs.TestDFSUpgrade
Running org.apache.hadoop.hdfs.TestBlockStoragePolicy
Tests run: 16, Failures: 0, Errors: 0, Skipped: 0, Time elapsed: 35.388 sec - in org.apache.hadoop.hdfs.TestBlockStoragePolicy
Running org.apache.hadoop.hdfs.TestFileLengthOnClusterRestart
Tests run: 1, Failures: 0, Errors: 0, Skipped: 0, Time elapsed: 10.064 sec - in org.apache.hadoop.hdfs.TestFileLengthOnClusterRestart
Running org.apache.hadoop.hdfs.TestBlockReaderFactory
Tests run: 7, Failures: 0, Errors: 0, Skipped: 0, Time elapsed: 11.327 sec - in org.apache.hadoop.hdfs.TestBlockReaderFactory
Running org.apache.hadoop.hdfs.qjournal.TestSecureNNWithQJM
Tests run: 2, Failures: 0, Errors: 0, Skipped: 0, Time elapsed: 43.155 sec - in org.apache.hadoop.hdfs.qjournal.TestSecureNNWithQJM
Running org.apache.hadoop.hdfs.qjournal.TestNNWithQJM
Tests run: 3, Failures: 0, Errors: 0, Skipped: 0, Time elapsed: 7.575 sec - in org.apache.hadoop.hdfs.qjournal.TestNNWithQJM
Running org.apache.hadoop.hdfs.qjournal.server.TestJournalNodeMXBean
Tests run: 1, Failures: 0, Errors: 0, Skipped: 0, Time elapsed: 1.661 sec - in org.apache.hadoop.hdfs.qjournal.server.TestJournalNodeMXBean
Running org.apache.hadoop.hdfs.qjournal.server.TestJournal
Tests run: 12, Failures: 0, Errors: 0, Skipped: 0, Time elapsed: 1.796 sec - in org.apache.hadoop.hdfs.qjournal.server.TestJournal
Running org.apache.hadoop.hdfs.qjournal.server.TestJournalNode
Tests run: 6, Failures: 0, Errors: 0, Skipped: 0, Time elapsed: 19.273 sec - in org.apache.hadoop.hdfs.qjournal.server.TestJournalNode
Running org.apache.hadoop.hdfs.qjournal.client.TestIPCLoggerChannel
Tests run: 3, Failures: 0, Errors: 0, Skipped: 0, Time elapsed: 1.159 sec - in org.apache.hadoop.hdfs.qjournal.client.TestIPCLoggerChannel
Running org.apache.hadoop.hdfs.qjournal.client.TestQJMWithFaults
Tests run: 2, Failures: 0, Errors: 0, Skipped: 0, Time elapsed: 151.975 sec - in org.apache.hadoop.hdfs.qjournal.client.TestQJMWithFaults
Running org.apache.hadoop.hdfs.qjournal.client.TestEpochsAreUnique
Tests run: 1, Failures: 0, Errors: 0, Skipped: 0, Time elapsed: 6.436 sec - in org.apache.hadoop.hdfs.qjournal.client.TestEpochsAreUnique
Running org.apache.hadoop.hdfs.qjournal.client.TestQuorumJournalManagerUnit
Tests run: 6, Failures: 0, Errors: 0, Skipped: 0, Time elapsed: 1.472 sec - in org.apache.hadoop.hdfs.qjournal.client.TestQuorumJournalManagerUnit
Running org.apache.hadoop.hdfs.qjournal.client.TestSegmentRecoveryComparator
Tests run: 1, Failures: 0, Errors: 0, Skipped: 0, Time elapsed: 0.301 sec - in org.apache.hadoop.hdfs.qjournal.client.TestSegmentRecoveryComparator
Running org.apache.hadoop.hdfs.qjournal.client.TestQuorumCall
Tests run: 1, Failures: 0, Errors: 0, Skipped: 0, Time elapsed: 0.268 sec - in org.apache.hadoop.hdfs.qjournal.client.TestQuorumCall
Running org.apache.hadoop.hdfs.qjournal.client.TestQuorumJournalManager
Tests run: 21, Failures: 0, Errors: 0, Skipped: 0, Time elapsed: 21.137 sec - in org.apache.hadoop.hdfs.qjournal.client.TestQuorumJournalManager
Running org.apache.hadoop.hdfs.qjournal.TestMiniJournalCluster
Tests run: 1, Failures: 0, Errors: 0, Skipped: 0, Time elapsed: 1.838 sec - in org.apache.hadoop.hdfs.qjournal.TestMiniJournalCluster
Running org.apache.hadoop.hdfs.TestFileCreationEmpty
Tests run: 1, Failures: 0, Errors: 0, Skipped: 0, Time elapsed: 9.069 sec - in org.apache.hadoop.hdfs.TestFileCreationEmpty
Running org.apache.hadoop.hdfs.TestBlockMissingException
Tests run: 1, Failures: 0, Errors: 0, Skipped: 0, Time elapsed: 4.343 sec - in org.apache.hadoop.hdfs.TestBlockMissingException
Running org.apache.hadoop.hdfs.TestDataTransferKeepalive
Tests run: 4, Failures: 0, Errors: 0, Skipped: 0, Time elapsed: 15.973 sec - in org.apache.hadoop.hdfs.TestDataTransferKeepalive
Running org.apache.hadoop.hdfs.TestModTime
Tests run: 2, Failures: 0, Errors: 0, Skipped: 0, Time elapsed: 12.234 sec - in org.apache.hadoop.hdfs.TestModTime
Running org.apache.hadoop.hdfs.TestRollingUpgradeDowngrade
Tests run: 2, Failures: 0, Errors: 0, Skipped: 0, Time elapsed: 8.265 sec - in org.apache.hadoop.hdfs.TestRollingUpgradeDowngrade
Running org.apache.hadoop.hdfs.TestLease
Tests run: 5, Failures: 0, Errors: 0, Skipped: 0, Time elapsed: 8.811 sec - in org.apache.hadoop.hdfs.TestLease
Running org.apache.hadoop.hdfs.TestParallelUnixDomainRead
Tests run: 4, Failures: 0, Errors: 0, Skipped: 0, Time elapsed: 40.332 sec - in org.apache.hadoop.hdfs.TestParallelUnixDomainRead
Running org.apache.hadoop.hdfs.TestDeprecatedKeys
Tests run: 1, Failures: 0, Errors: 0, Skipped: 0, Time elapsed: 0.553 sec - in org.apache.hadoop.hdfs.TestDeprecatedKeys
Running org.apache.hadoop.hdfs.TestFSOutputSummer
Tests run: 2, Failures: 0, Errors: 0, Skipped: 0, Time elapsed: 7.565 sec - in org.apache.hadoop.hdfs.TestFSOutputSummer
Running org.apache.hadoop.hdfs.TestRead
Tests run: 3, Failures: 0, Errors: 0, Skipped: 0, Time elapsed: 6.089 sec - in org.apache.hadoop.hdfs.TestRead
Running org.apache.hadoop.hdfs.TestAppendSnapshotTruncate
Tests run: 1, Failures: 0, Errors: 0, Skipped: 0, Time elapsed: 14.755 sec - in org.apache.hadoop.hdfs.TestAppendSnapshotTruncate
Running org.apache.hadoop.hdfs.TestDFSInotifyEventInputStream
Tests run: 5, Failures: 0, Errors: 0, Skipped: 0, Time elapsed: 18.847 sec - in org.apache.hadoop.hdfs.TestDFSInotifyEventInputStream
Running org.apache.hadoop.hdfs.TestCrcCorruption
Tests run: 4, Failures: 0, Errors: 0, Skipped: 0, Time elapsed: 16.569 sec - in org.apache.hadoop.hdfs.TestCrcCorruption
Running org.apache.hadoop.hdfs.TestGetBlocks
Tests run: 3, Failures: 0, Errors: 0, Skipped: 0, Time elapsed: 45.953 sec - in org.apache.hadoop.hdfs.TestGetBlocks
Running org.apache.hadoop.hdfs.TestDataTransferProtocol
Tests run: 4, Failures: 0, Errors: 0, Skipped: 0, Time elapsed: 5.932 sec - in org.apache.hadoop.hdfs.TestDataTransferProtocol
Running org.apache.hadoop.hdfs.TestReadWhileWriting
Tests run: 1, Failures: 0, Errors: 0, Skipped: 0, Time elapsed: 6.64 sec - in org.apache.hadoop.hdfs.TestReadWhileWriting
Running org.apache.hadoop.hdfs.TestKeyProviderCache
Tests run: 1, Failures: 0, Errors: 0, Skipped: 0, Time elapsed: 0.564 sec - in org.apache.hadoop.hdfs.TestKeyProviderCache
Running org.apache.hadoop.net.TestNetworkTopology
Tests run: 10, Failures: 0, Errors: 0, Skipped: 0, Time elapsed: 8.966 sec - in org.apache.hadoop.net.TestNetworkTopology
Running org.apache.hadoop.tracing.TestTraceAdmin
Tests run: 1, Failures: 0, Errors: 0, Skipped: 0, Time elapsed: 4.022 sec - in org.apache.hadoop.tracing.TestTraceAdmin
Running org.apache.hadoop.tracing.TestTracingShortCircuitLocalRead
Tests run: 1, Failures: 0, Errors: 0, Skipped: 0, Time elapsed: 4.519 sec - in org.apache.hadoop.tracing.TestTracingShortCircuitLocalRead
Running org.apache.hadoop.tracing.TestTracing
Tests run: 5, Failures: 0, Errors: 0, Skipped: 0, Time elapsed: 5.176 sec - in org.apache.hadoop.tracing.TestTracing
Running org.apache.hadoop.TestRefreshCallQueue
Tests run: 1, Failures: 0, Errors: 0, Skipped: 0, Time elapsed: 3.929 sec - in org.apache.hadoop.TestRefreshCallQueue

Results :

Tests in error: 
  TestBlockReaderLocal.testBlockReaderLocalReadZeroBytesNoChecksumNoReadahead:698->runBlockReaderLocalTest:143
» NoClassDefFound
  TestBlockReaderLocal.TestStatisticsForShortCircuitLocalRead:705->testStatistics:735 »
NoClassDefFound
  TestBlockReaderLocal.testBlockReaderLocalOnFileWithoutChecksumNoReadahead:663->runBlockReaderLocalTest:143
» NoClassDefFound
  TestBlockReaderLocal.testBlockReaderLocalImmediateClose:221->runBlockReaderLocalTest:143
» NoClassDefFound
  TestBlockReaderLocal.testBlockReaderLocalReadZeroBytesNoChecksum:684->runBlockReaderLocalTest:143
» NoClassDefFound
  TestBlockReaderLocal.testBlockReaderSimpleReads:247->runBlockReaderLocalTest:143 » NoClassDefFound
  TestBlockReaderLocal.testBlockReaderLocalByteBufferFastLaneReadsNoChecksum:419->runBlockReaderLocalTest:143
» NoClassDefFound
  TestBlockReaderLocal.testBlockReaderLocalArrayReads2NoReadahead:311->runBlockReaderLocalTest:143
» NoClassDefFound
  TestBlockReaderLocal.testBlockReaderLocalByteBufferReadsNoChecksumNoReadahead:363->runBlockReaderLocalTest:143
» NoClassDefFound
  TestBlockReaderLocal.testBlockReaderLocalWithMlockChanges:576->runBlockReaderLocalTest:143
» NoClassDefFound
  TestBlockReaderLocal.testBlockReaderLocalReadCorruptNoChecksumNoReadahead:544->runBlockReaderLocalTest:143
» NoClassDefFound
  TestBlockReaderLocal.testBlockReaderLocalReadCorrupt:524->runBlockReaderLocalTest:143
» NoClassDefFound
  TestBlockReaderLocal.testBlockReaderLocalByteBufferFastLaneReadsNoChecksumNoReadahead:434->runBlockReaderLocalTest:143
» NoClassDefFound
  TestBlockReaderLocal.testBlockReaderLocalOnFileWithoutChecksumNoChecksumNoReadahead:670->runBlockReaderLocalTest:143
» NoClassDefFound
  TestBlockReaderLocal.testBlockReaderLocalArrayReads2:297->runBlockReaderLocalTest:143
» NoClassDefFound
  TestBlockReaderLocal.testBlockReaderLocalReadCorruptStart:473->runBlockReaderLocalTest:143
» NoClassDefFound
  TestBlockReaderLocal.testBlockReaderLocalOnFileWithoutChecksum:649->runBlockReaderLocalTest:143
» NoClassDefFound
  TestBlockReaderLocal.TestStatisticsForLocalRead:710->testStatistics:735 » NoClassDefFound
  TestBlockReaderLocal.testBlockReaderLocalReadZeroBytes:677->runBlockReaderLocalTest:143
» NoClassDefFound
  TestBlockReaderLocal.testBlockReaderLocalReadCorruptNoChecksum:531->runBlockReaderLocalTest:143
» NoClassDefFound
  TestBlockReaderLocal.testBlockReaderLocalByteBufferReadsNoChecksum:348->runBlockReaderLocalTest:143
» NoClassDefFound
  TestBlockReaderLocal.testBlockReaderLocalWithMlockChangesNoChecksum:583->runBlockReaderLocalTest:143
» NoClassDefFound
  TestBlockReaderLocal.testBlockReaderLocalArrayReads2NoChecksum:304->runBlockReaderLocalTest:143
» NoClassDefFound
  TestBlockReaderLocal.testBlockReaderLocalByteBufferReadsNoReadahead:356->runBlockReaderLocalTest:143
» NoClassDefFound
  TestBlockReaderLocal.testBlockReaderLocalByteBufferFastLaneReads:412->runBlockReaderLocalTest:143
» NoClassDefFound
  TestBlockReaderLocal.testBlockReaderSimpleReadsNoChecksumNoReadahead:271->runBlockReaderLocalTest:143
» NoClassDefFound
  TestBlockReaderLocal.testBlockReaderLocalArrayReads2NoChecksumNoReadahead:317->runBlockReaderLocalTest:143
» NoClassDefFound
  TestBlockReaderLocal.testBlockReaderLocalWithMlockChangesNoReadahead:590->runBlockReaderLocalTest:143
» NoClassDefFound
  TestBlockReaderLocal.testBlockReaderLocalWithMlockChangesNoChecksumNoReadahead:597->runBlockReaderLocalTest:143
» NoClassDefFound
  TestBlockReaderLocal.testBlockReaderLocalReadCorruptNoReadahead:538->runBlockReaderLocalTest:143
» NoClassDefFound
  TestBlockReaderLocal.testBlockReaderSimpleReadsNoReadahead:265->runBlockReaderLocalTest:143
» NoClassDefFound
  TestBlockReaderLocal.testBlockReaderLocalReadZeroBytesNoReadahead:691->runBlockReaderLocalTest:143
» NoClassDefFound
  TestBlockReaderLocal.testBlockReaderSimpleReadsNoChecksum:259->runBlockReaderLocalTest:143
» NoClassDefFound
  TestBlockReaderLocal.testBlockReaderLocalByteBufferReads:341->runBlockReaderLocalTest:143
» NoClassDefFound
  TestBlockReaderLocal.testBlockReaderLocalOnFileWithoutChecksumNoChecksum:656->runBlockReaderLocalTest:143
» NoClassDefFound
  TestBlockReaderLocal.testBlockReaderLocalByteBufferFastLaneReadsNoReadahead:427->runBlockReaderLocalTest:143
» NoClassDefFound
  TestBlockReaderLocal.testBlockReaderSimpleReadsShortReadahead:253->runBlockReaderLocalTest:143
» NoClassDefFound
  TestEncryptedTransfer.testEncryptedReadWithAES:212 » Runtime java.util.zip.Zip...
  TestEncryptedTransfer.testEncryptedReadWithRC4:157 » NullPointer
  TestEncryptedTransfer.testLongLivedReadClientAfterRestart:364 » NullPointer
  TestEncryptedTransfer.testEncryptedRead:104 » NullPointer
  TestEncryptedTransfer.testEncryptedWriteWithTwoDns:491->testEncryptedWrite:503->setEncryptionConfigKeys:77
» Runtime
  TestEncryptedTransfer.testEncryptedWriteWithOneDn:486->testEncryptedWrite:503->setEncryptionConfigKeys:77
» Runtime
  TestEncryptedTransfer.testEncryptedAppend:542->setEncryptionConfigKeys:77 » Runtime
  TestEncryptedTransfer.testEncryptedWriteWithMultipleDns:496->testEncryptedWrite:503->setEncryptionConfigKeys:77
» Runtime
  TestEncryptedTransfer.testLongLivedWriteClientAfterRestart:407->setEncryptionConfigKeys:77
» Runtime
  TestEncryptedTransfer.testEncryptedAppendRequiringBlockTransfer:567->setEncryptionConfigKeys:77
» Runtime
  TestEncryptedTransfer.testEncryptedReadAfterNameNodeRestart:267 » NullPointer
  TestEncryptedTransfer.testClientThatDoesNotSupportEncryption:308 » Runtime jav...
  TestEncryptedTransfer.testLongLivedClient:437 » NullPointer
  TestEncryptedTransfer.testEncryptedReadWithAES:212 » Runtime java.util.zip.Zip...
  TestEncryptedTransfer.testEncryptedReadWithRC4:157 » NullPointer
  TestEncryptedTransfer.testLongLivedReadClientAfterRestart:364 » NullPointer
  TestEncryptedTransfer.testEncryptedRead:104 » NullPointer

Tests run: 3327, Failures: 0, Errors: 54, Skipped: 18

[INFO]                                                                         
[INFO] ------------------------------------------------------------------------
[INFO] Skipping Apache Hadoop HttpFS
[INFO] This project has been banned from the build due to previous failures.
[INFO] ------------------------------------------------------------------------
[INFO]                                                                         
[INFO] ------------------------------------------------------------------------
[INFO] Skipping Apache Hadoop HDFS BookKeeper Journal
[INFO] This project has been banned from the build due to previous failures.
[INFO] ------------------------------------------------------------------------
[INFO]                                                                         
[INFO] ------------------------------------------------------------------------
[INFO] Skipping Apache Hadoop HDFS-NFS
[INFO] This project has been banned from the build due to previous failures.
[INFO] ------------------------------------------------------------------------
[INFO]                                                                         
[INFO] ------------------------------------------------------------------------
[INFO] Building Apache Hadoop HDFS Project 3.0.0-SNAPSHOT
[INFO] ------------------------------------------------------------------------
[WARNING] The POM for org.eclipse.m2e:lifecycle-mapping:jar:1.0.0 is missing, no dependency
information available
[WARNING] Failed to retrieve plugin descriptor for org.eclipse.m2e:lifecycle-mapping:1.0.0:
Plugin org.eclipse.m2e:lifecycle-mapping:1.0.0 or one of its dependencies could not be resolved:
Failure to find org.eclipse.m2e:lifecycle-mapping:jar:1.0.0 in http://repo.maven.apache.org/maven2
was cached in the local repository, resolution will not be reattempted until the update interval
of central has elapsed or updates are forced
[INFO] 
[INFO] --- maven-clean-plugin:2.5:clean (default-clean) @ hadoop-hdfs-project ---
[INFO] Deleting <https://builds.apache.org/job/Hadoop-Hdfs-trunk/ws/hadoop-hdfs-project/target>
[INFO] 
[INFO] --- maven-antrun-plugin:1.7:run (create-testdirs) @ hadoop-hdfs-project ---
[INFO] Executing tasks

main:
    [mkdir] Created dir: <https://builds.apache.org/job/Hadoop-Hdfs-trunk/ws/hadoop-hdfs-project/target/test-dir>
[INFO] Executed tasks
[INFO] 
[INFO] --- maven-source-plugin:2.3:jar-no-fork (hadoop-java-sources) @ hadoop-hdfs-project
---
[INFO] 
[INFO] --- maven-source-plugin:2.3:test-jar-no-fork (hadoop-java-sources) @ hadoop-hdfs-project
---
[INFO] 
[INFO] --- maven-enforcer-plugin:1.3.1:enforce (dist-enforce) @ hadoop-hdfs-project ---
[INFO] 
[INFO] --- maven-site-plugin:3.4:attach-descriptor (attach-descriptor) @ hadoop-hdfs-project
---
[INFO] 
[INFO] --- maven-javadoc-plugin:2.8.1:jar (module-javadocs) @ hadoop-hdfs-project ---
[INFO] Skipping javadoc generation
[INFO] 
[INFO] --- maven-enforcer-plugin:1.3.1:enforce (depcheck) @ hadoop-hdfs-project ---
[INFO] 
[INFO] --- maven-checkstyle-plugin:2.12.1:checkstyle (default-cli) @ hadoop-hdfs-project ---
[INFO] 
[INFO] --- findbugs-maven-plugin:3.0.0:findbugs (default-cli) @ hadoop-hdfs-project ---
[INFO] ------------------------------------------------------------------------
[INFO] Reactor Summary:
[INFO] 
[INFO] Apache Hadoop HDFS Client ......................... SUCCESS [  5.947 s]
[INFO] Apache Hadoop HDFS ................................ FAILURE [  03:11 h]
[INFO] Apache Hadoop HttpFS .............................. SKIPPED
[INFO] Apache Hadoop HDFS BookKeeper Journal ............. SKIPPED
[INFO] Apache Hadoop HDFS-NFS ............................ SKIPPED
[INFO] Apache Hadoop HDFS Project ........................ SUCCESS [  0.129 s]
[INFO] ------------------------------------------------------------------------
[INFO] BUILD FAILURE
[INFO] ------------------------------------------------------------------------
[INFO] Total time: 03:11 h
[INFO] Finished at: 2015-04-03T14:45:46+00:00
[INFO] Final Memory: 57M/612M
[INFO] ------------------------------------------------------------------------
[ERROR] Failed to execute goal org.apache.maven.plugins:maven-surefire-plugin:2.17:test (default-test)
on project hadoop-hdfs: There was a timeout or other error in the fork -> [Help 1]
[ERROR] 
[ERROR] To see the full stack trace of the errors, re-run Maven with the -e switch.
[ERROR] Re-run Maven using the -X switch to enable full debug logging.
[ERROR] 
[ERROR] For more information about the errors and possible solutions, please read the following
articles:
[ERROR] [Help 1] http://cwiki.apache.org/confluence/display/MAVEN/MojoFailureException
[ERROR] 
[ERROR] After correcting the problems, you can resume the build with the command
[ERROR]   mvn <goals> -rf :hadoop-hdfs
Build step 'Execute shell' marked build as failure
Archiving artifacts
Sending artifact delta relative to Hadoop-Hdfs-trunk #2080
Archived 1 artifacts
Archive block size is 32768
Received 0 blocks and 1736 bytes
Compression is 0.0%
Took 5.2 sec
Recording test results
Updating YARN-2901
Updating HDFS-7954
Updating YARN-3365
Updating HDFS-7811
Updating HDFS-7888
Updating HADOOP-11797
Updating HADOOP-9805
Updating HDFS-7893
Updating YARN-3415
Updating MAPREDUCE-6303
Updating HDFS-8035

Mime
View raw message