hadoop-hdfs-dev mailing list archives

Site index · List index
Message view « Date » · « Thread »
Top « Date » · « Thread »
From Apache Jenkins Server <jenk...@builds.apache.org>
Subject Hadoop-Hdfs-trunk - Build # 2105 - Still Failing
Date Fri, 24 Apr 2015 11:35:06 GMT
See https://builds.apache.org/job/Hadoop-Hdfs-trunk/2105/

###################################################################################
########################## LAST 60 LINES OF THE CONSOLE ###########################
[...truncated 5190 lines...]
[INFO] Skipping javadoc generation
[INFO] 
[INFO] --- maven-enforcer-plugin:1.3.1:enforce (depcheck) @ hadoop-hdfs-project ---
[INFO] 
[INFO] --- maven-checkstyle-plugin:2.12.1:checkstyle (default-cli) @ hadoop-hdfs-project ---
[INFO] 
[INFO] --- findbugs-maven-plugin:3.0.0:findbugs (default-cli) @ hadoop-hdfs-project ---
[INFO] ------------------------------------------------------------------------
[INFO] Reactor Summary:
[INFO] 
[INFO] Apache Hadoop HDFS Client ......................... FAILURE [ 25.342 s]
[INFO] Apache Hadoop HDFS ................................ SKIPPED
[INFO] Apache Hadoop HttpFS .............................. SKIPPED
[INFO] Apache Hadoop HDFS BookKeeper Journal ............. SKIPPED
[INFO] Apache Hadoop HDFS-NFS ............................ SKIPPED
[INFO] Apache Hadoop HDFS Project ........................ SUCCESS [  0.123 s]
[INFO] ------------------------------------------------------------------------
[INFO] BUILD FAILURE
[INFO] ------------------------------------------------------------------------
[INFO] Total time: 26.833 s
[INFO] Finished at: 2015-04-24T11:34:47+00:00
[INFO] Final Memory: 55M/723M
[INFO] ------------------------------------------------------------------------
[ERROR] Failed to execute goal org.apache.maven.plugins:maven-checkstyle-plugin:2.12.1:checkstyle
(default-cli) on project hadoop-hdfs-client: An error has occurred in Checkstyle report generation.
Failed during checkstyle execution: Unable to find configuration file at location: file:///home/jenkins/jenkins-slave/workspace/Hadoop-Hdfs-trunk/hadoop-hdfs-project/hadoop-hdfs-client/dev-support/checkstyle.xml:
Could not find resource 'file:///home/jenkins/jenkins-slave/workspace/Hadoop-Hdfs-trunk/hadoop-hdfs-project/hadoop-hdfs-client/dev-support/checkstyle.xml'.
-> [Help 1]
[ERROR] 
[ERROR] To see the full stack trace of the errors, re-run Maven with the -e switch.
[ERROR] Re-run Maven using the -X switch to enable full debug logging.
[ERROR] 
[ERROR] For more information about the errors and possible solutions, please read the following
articles:
[ERROR] [Help 1] http://cwiki.apache.org/confluence/display/MAVEN/MojoExecutionException
Build step 'Execute shell' marked build as failure
Archiving artifacts
Sending artifact delta relative to Hadoop-Hdfs-trunk #2088
Archived 1 artifacts
Archive block size is 32768
Received 0 blocks and 315127 bytes
Compression is 0.0%
Took 7.5 sec
Recording test results
Updating YARN-3522
Updating HDFS-8070
Updating HADOOP-11802
Updating HADOOP-11627
Updating HDFS-8231
Updating HDFS-7915
Updating YARN-3516
Updating HDFS-8147
Updating HADOOP-11852
Updating HDFS-8052
Updating YARN-3413
Updating YARN-3319
Updating YARN-3434
Updating HADOOP-11730
Updating HDFS-8217
Updating HDFS-8215
Updating HADOOP-10597
Sending e-mails to: hdfs-dev@hadoop.apache.org
Email was triggered for: Failure
Sending email for trigger: Failure



###################################################################################
############################## FAILED TESTS (if any) ##############################
No tests ran.
Mime
  • Unnamed multipart/mixed (inline, None, 0 bytes)
View raw message