hadoop-hdfs-dev mailing list archives

Site index · List index
Message view « Date » · « Thread »
Top « Date » · « Thread »
From Apache Jenkins Server <jenk...@builds.apache.org>
Subject Hadoop-Hdfs-trunk-Java8 - Build # 126 - Still Failing
Date Tue, 17 Mar 2015 14:32:33 GMT
See https://builds.apache.org/job/Hadoop-Hdfs-trunk-Java8/126/

###################################################################################
########################## LAST 60 LINES OF THE CONSOLE ###########################
[...truncated 7937 lines...]
[INFO] --- maven-javadoc-plugin:2.8.1:jar (module-javadocs) @ hadoop-hdfs-project ---
[INFO] Not executing Javadoc as the project is not a Java classpath-capable package
[INFO] 
[INFO] --- maven-enforcer-plugin:1.3.1:enforce (depcheck) @ hadoop-hdfs-project ---
[INFO] 
[INFO] --- maven-checkstyle-plugin:2.12.1:checkstyle (default-cli) @ hadoop-hdfs-project ---
[INFO] 
[INFO] --- findbugs-maven-plugin:3.0.0:findbugs (default-cli) @ hadoop-hdfs-project ---
[INFO] ------------------------------------------------------------------------
[INFO] Reactor Summary:
[INFO] 
[INFO] Apache Hadoop HDFS ................................ FAILURE [  02:57 h]
[INFO] Apache Hadoop HttpFS .............................. SKIPPED
[INFO] Apache Hadoop HDFS BookKeeper Journal ............. SKIPPED
[INFO] Apache Hadoop HDFS-NFS ............................ SKIPPED
[INFO] Apache Hadoop HDFS Project ........................ SUCCESS [  1.773 s]
[INFO] ------------------------------------------------------------------------
[INFO] BUILD FAILURE
[INFO] ------------------------------------------------------------------------
[INFO] Total time: 02:57 h
[INFO] Finished at: 2015-03-17T14:32:01+00:00
[INFO] Final Memory: 48M/249M
[INFO] ------------------------------------------------------------------------
[ERROR] Failed to execute goal org.apache.maven.plugins:maven-surefire-plugin:2.17:test (default-test)
on project hadoop-hdfs: There are test failures.
[ERROR] 
[ERROR] Please refer to /home/jenkins/jenkins-slave/workspace/Hadoop-Hdfs-trunk-Java8/hadoop-hdfs-project/hadoop-hdfs/target/surefire-reports
for the individual test results.
[ERROR] -> [Help 1]
[ERROR] 
[ERROR] To see the full stack trace of the errors, re-run Maven with the -e switch.
[ERROR] Re-run Maven using the -X switch to enable full debug logging.
[ERROR] 
[ERROR] For more information about the errors and possible solutions, please read the following
articles:
[ERROR] [Help 1] http://cwiki.apache.org/confluence/display/MAVEN/MojoFailureException
Build step 'Execute shell' marked build as failure
Archiving artifacts
Recording test results
Updating HDFS-7886
Updating MAPREDUCE-6105
Updating HADOOP-11638
Updating MAPREDUCE-6100
Updating HADOOP-11692
Updating HADOOP-11720
Updating MAPREDUCE-4653
Updating HDFS-5356
Updating HDFS-7838
Updating YARN-1453
Updating YARN-3197
Updating HADOOP-11714
Updating HADOOP-9477
Updating MAPREDUCE-4414
Updating YARN-3349
Updating YARN-2854
Updating MAPREDUCE-5755
Updating HADOOP-8059
Updating HDFS-2360
Updating YARN-3339
Sending e-mails to: hdfs-dev@hadoop.apache.org
Email was triggered for: Failure
Sending email for trigger: Failure



###################################################################################
############################## FAILED TESTS (if any) ##############################
1 tests failed.
REGRESSION:  org.apache.hadoop.hdfs.qjournal.TestSecureNNWithQJM.testSecureMode

Error Message:
test timed out after 30000 milliseconds

Stack Trace:
java.lang.Exception: test timed out after 30000 milliseconds
	at java.lang.Thread.sleep(Native Method)
	at org.mortbay.thread.QueuedThreadPool.doStop(QueuedThreadPool.java:435)
	at org.mortbay.component.AbstractLifeCycle.stop(AbstractLifeCycle.java:76)
	at org.mortbay.jetty.Server.doStop(Server.java:291)
	at org.mortbay.component.AbstractLifeCycle.stop(AbstractLifeCycle.java:76)
	at org.apache.hadoop.http.HttpServer2.stop(HttpServer2.java:852)
	at org.apache.hadoop.hdfs.qjournal.server.JournalNodeHttpServer.stop(JournalNodeHttpServer.java:75)
	at org.apache.hadoop.hdfs.qjournal.server.JournalNode.stop(JournalNode.java:192)
	at org.apache.hadoop.hdfs.qjournal.server.JournalNode.stopAndJoin(JournalNode.java:220)
	at org.apache.hadoop.hdfs.qjournal.MiniJournalCluster.shutdown(MiniJournalCluster.java:146)
	at org.apache.hadoop.hdfs.qjournal.TestSecureNNWithQJM.shutdown(TestSecureNNWithQJM.java:153)



Mime
  • Unnamed multipart/mixed (inline, None, 0 bytes)
View raw message