hadoop-hdfs-dev mailing list archives

Site index · List index
Message view « Date » · « Thread »
Top « Date » · « Thread »
From Apache Jenkins Server <jenk...@builds.apache.org>
Subject Hadoop-Hdfs-trunk-Java8 - Build # 119 - Still Failing
Date Tue, 10 Mar 2015 15:04:10 GMT
See https://builds.apache.org/job/Hadoop-Hdfs-trunk-Java8/119/

###################################################################################
########################## LAST 60 LINES OF THE CONSOLE ###########################
[...truncated 8936 lines...]

main:
    [mkdir] Created dir: /home/jenkins/jenkins-slave/workspace/Hadoop-Hdfs-trunk-Java8/hadoop-hdfs-project/target/test-dir
[INFO] Executed tasks
[INFO] 
[INFO] --- maven-source-plugin:2.3:jar-no-fork (hadoop-java-sources) @ hadoop-hdfs-project
---
[INFO] 
[INFO] --- maven-source-plugin:2.3:test-jar-no-fork (hadoop-java-sources) @ hadoop-hdfs-project
---
[INFO] 
[INFO] --- maven-enforcer-plugin:1.3.1:enforce (dist-enforce) @ hadoop-hdfs-project ---
[INFO] 
[INFO] --- maven-site-plugin:3.4:attach-descriptor (attach-descriptor) @ hadoop-hdfs-project
---
[INFO] 
[INFO] --- maven-javadoc-plugin:2.8.1:jar (module-javadocs) @ hadoop-hdfs-project ---
[INFO] Not executing Javadoc as the project is not a Java classpath-capable package
[INFO] 
[INFO] --- maven-enforcer-plugin:1.3.1:enforce (depcheck) @ hadoop-hdfs-project ---
[INFO] 
[INFO] --- maven-checkstyle-plugin:2.12.1:checkstyle (default-cli) @ hadoop-hdfs-project ---
[INFO] 
[INFO] --- findbugs-maven-plugin:3.0.0:findbugs (default-cli) @ hadoop-hdfs-project ---
[INFO] ------------------------------------------------------------------------
[INFO] Reactor Summary:
[INFO] 
[INFO] Apache Hadoop HDFS ................................ FAILURE [  03:29 h]
[INFO] Apache Hadoop HttpFS .............................. SKIPPED
[INFO] Apache Hadoop HDFS BookKeeper Journal ............. SKIPPED
[INFO] Apache Hadoop HDFS-NFS ............................ SKIPPED
[INFO] Apache Hadoop HDFS Project ........................ SUCCESS [  1.778 s]
[INFO] ------------------------------------------------------------------------
[INFO] BUILD FAILURE
[INFO] ------------------------------------------------------------------------
[INFO] Total time: 03:29 h
[INFO] Finished at: 2015-03-10T15:03:44+00:00
[INFO] Final Memory: 60M/230M
[INFO] ------------------------------------------------------------------------
[ERROR] Failed to execute goal org.apache.maven.plugins:maven-surefire-plugin:2.17:test (default-test)
on project hadoop-hdfs: There was a timeout or other error in the fork -> [Help 1]
[ERROR] 
[ERROR] To see the full stack trace of the errors, re-run Maven with the -e switch.
[ERROR] Re-run Maven using the -X switch to enable full debug logging.
[ERROR] 
[ERROR] For more information about the errors and possible solutions, please read the following
articles:
[ERROR] [Help 1] http://cwiki.apache.org/confluence/display/MAVEN/MojoFailureException
Build step 'Execute shell' marked build as failure
Archiving artifacts
Recording test results
Updating HADOOP-11226
Updating HADOOP-11686
Updating HDFS-7898
Updating HDFS-6806
Updating HADOOP-11638
Updating YARN-3300
Updating HADOOP-11668
Updating HADOOP-11692
Updating HADOOP-10115
Updating YARN-3287
Sending e-mails to: hdfs-dev@hadoop.apache.org
Email was triggered for: Failure
Sending email for trigger: Failure



###################################################################################
############################## FAILED TESTS (if any) ##############################
3 tests failed.
REGRESSION:  org.apache.hadoop.hdfs.qjournal.TestSecureNNWithQJM.testSecureMode

Error Message:
test timed out after 30000 milliseconds

Stack Trace:
java.lang.Exception: test timed out after 30000 milliseconds
	at java.net.SocketInputStream.socketRead0(Native Method)
	at java.net.SocketInputStream.read(SocketInputStream.java:150)
	at java.net.SocketInputStream.read(SocketInputStream.java:121)
	at sun.security.ssl.InputRecord.readFully(InputRecord.java:465)
	at sun.security.ssl.InputRecord.read(InputRecord.java:503)
	at sun.security.ssl.SSLSocketImpl.readRecord(SSLSocketImpl.java:954)
	at sun.security.ssl.SSLSocketImpl.readDataRecord(SSLSocketImpl.java:911)
	at sun.security.ssl.AppInputStream.read(AppInputStream.java:105)
	at java.io.BufferedInputStream.fill(BufferedInputStream.java:246)
	at java.io.BufferedInputStream.read1(BufferedInputStream.java:286)
	at java.io.BufferedInputStream.read(BufferedInputStream.java:345)
	at sun.net.www.http.HttpClient.parseHTTPHeader(HttpClient.java:701)
	at sun.net.www.http.HttpClient.parseHTTP(HttpClient.java:647)
	at sun.net.www.protocol.http.HttpURLConnection.getInputStream0(HttpURLConnection.java:1534)
	at sun.net.www.protocol.http.HttpURLConnection.getInputStream(HttpURLConnection.java:1439)
	at java.net.HttpURLConnection.getResponseCode(HttpURLConnection.java:480)
	at sun.net.www.protocol.https.HttpsURLConnectionImpl.getResponseCode(HttpsURLConnectionImpl.java:338)
	at org.apache.hadoop.hdfs.server.namenode.EditLogFileInputStream$URLLog$1.run(EditLogFileInputStream.java:466)
	at org.apache.hadoop.hdfs.server.namenode.EditLogFileInputStream$URLLog$1.run(EditLogFileInputStream.java:455)
	at java.security.AccessController.doPrivileged(Native Method)
	at javax.security.auth.Subject.doAs(Subject.java:422)
	at org.apache.hadoop.security.UserGroupInformation.doAs(UserGroupInformation.java:1669)
	at org.apache.hadoop.security.SecurityUtil.doAsUser(SecurityUtil.java:448)
	at org.apache.hadoop.security.SecurityUtil.doAsCurrentUser(SecurityUtil.java:442)
	at org.apache.hadoop.hdfs.server.namenode.EditLogFileInputStream$URLLog.getInputStream(EditLogFileInputStream.java:454)
	at org.apache.hadoop.hdfs.server.namenode.EditLogFileInputStream.init(EditLogFileInputStream.java:140)
	at org.apache.hadoop.hdfs.server.namenode.EditLogFileInputStream.nextOpImpl(EditLogFileInputStream.java:191)
	at org.apache.hadoop.hdfs.server.namenode.EditLogFileInputStream.nextOp(EditLogFileInputStream.java:249)
	at org.apache.hadoop.hdfs.server.namenode.EditLogInputStream.readOp(EditLogInputStream.java:85)
	at org.apache.hadoop.hdfs.server.namenode.EditLogInputStream.skipUntil(EditLogInputStream.java:151)
	at org.apache.hadoop.hdfs.server.namenode.RedundantEditLogInputStream.nextOp(RedundantEditLogInputStream.java:178)
	at org.apache.hadoop.hdfs.server.namenode.EditLogInputStream.readOp(EditLogInputStream.java:85)
	at org.apache.hadoop.hdfs.server.namenode.EditLogInputStream.skipUntil(EditLogInputStream.java:151)
	at org.apache.hadoop.hdfs.server.namenode.RedundantEditLogInputStream.nextOp(RedundantEditLogInputStream.java:178)
	at org.apache.hadoop.hdfs.server.namenode.EditLogInputStream.readOp(EditLogInputStream.java:85)
	at org.apache.hadoop.hdfs.server.namenode.FSEditLogLoader.loadEditRecords(FSEditLogLoader.java:188)
	at org.apache.hadoop.hdfs.server.namenode.FSEditLogLoader.loadFSEdits(FSEditLogLoader.java:141)
	at org.apache.hadoop.hdfs.server.namenode.FSImage.loadEdits(FSImage.java:828)
	at org.apache.hadoop.hdfs.server.namenode.FSImage.loadFSImage(FSImage.java:687)
	at org.apache.hadoop.hdfs.server.namenode.FSImage.recoverTransitionRead(FSImage.java:294)
	at org.apache.hadoop.hdfs.server.namenode.FSNamesystem.loadFSImage(FSNamesystem.java:974)
	at org.apache.hadoop.hdfs.server.namenode.FSNamesystem.loadFromDisk(FSNamesystem.java:688)
	at org.apache.hadoop.hdfs.server.namenode.NameNode.loadNamesystem(NameNode.java:585)
	at org.apache.hadoop.hdfs.server.namenode.NameNode.initialize(NameNode.java:644)
	at org.apache.hadoop.hdfs.server.namenode.NameNode.<init>(NameNode.java:811)
	at org.apache.hadoop.hdfs.server.namenode.NameNode.<init>(NameNode.java:795)
	at org.apache.hadoop.hdfs.server.namenode.NameNode.createNameNode(NameNode.java:1492)
	at org.apache.hadoop.hdfs.MiniDFSCluster.restartNameNode(MiniDFSCluster.java:1818)
	at org.apache.hadoop.hdfs.MiniDFSCluster.restartNameNode(MiniDFSCluster.java:1783)
	at org.apache.hadoop.hdfs.qjournal.TestSecureNNWithQJM.restartNameNode(TestSecureNNWithQJM.java:197)
	at org.apache.hadoop.hdfs.qjournal.TestSecureNNWithQJM.doNNWithQJMTest(TestSecureNNWithQJM.java:185)
	at org.apache.hadoop.hdfs.qjournal.TestSecureNNWithQJM.testSecureMode(TestSecureNNWithQJM.java:159)


REGRESSION:  org.apache.hadoop.hdfs.server.namenode.ha.TestRetryCacheWithHA.testUpdatePipeline

Error Message:
After waiting the operation updatePipeline still has not taken effect on NN yet

Stack Trace:
java.lang.AssertionError: After waiting the operation updatePipeline still has not taken effect
on NN yet
	at org.junit.Assert.fail(Assert.java:88)
	at org.junit.Assert.assertTrue(Assert.java:41)
	at org.apache.hadoop.hdfs.server.namenode.ha.TestRetryCacheWithHA.testClientRetryWithFailover(TestRetryCacheWithHA.java:1280)
	at org.apache.hadoop.hdfs.server.namenode.ha.TestRetryCacheWithHA.testUpdatePipeline(TestRetryCacheWithHA.java:1178)


FAILED:  org.apache.hadoop.hdfs.server.namenode.ha.TestPipelinesFailover.testFailoverRightBeforeCommitSynchronization

Error Message:
test timed out after 30000 milliseconds

Stack Trace:
java.lang.Exception: test timed out after 30000 milliseconds
	at sun.misc.Unsafe.park(Native Method)
	at java.util.concurrent.locks.LockSupport.park(LockSupport.java:175)
	at java.util.concurrent.locks.AbstractQueuedSynchronizer.parkAndCheckInterrupt(AbstractQueuedSynchronizer.java:836)
	at java.util.concurrent.locks.AbstractQueuedSynchronizer.doAcquireSharedInterruptibly(AbstractQueuedSynchronizer.java:997)
	at java.util.concurrent.locks.AbstractQueuedSynchronizer.acquireSharedInterruptibly(AbstractQueuedSynchronizer.java:1304)
	at java.util.concurrent.CountDownLatch.await(CountDownLatch.java:231)
	at org.apache.hadoop.test.GenericTestUtils$DelayAnswer.waitForCall(GenericTestUtils.java:226)
	at org.apache.hadoop.hdfs.server.namenode.ha.TestPipelinesFailover.testFailoverRightBeforeCommitSynchronization(TestPipelinesFailover.java:379)



Mime
  • Unnamed multipart/mixed (inline, None, 0 bytes)
View raw message