hadoop-hdfs-dev mailing list archives

Site index · List index
Message view « Date » · « Thread »
Top « Date » · « Thread »
From Apache Jenkins Server <jenk...@builds.apache.org>
Subject Build failed in Jenkins: Hadoop-Hdfs-trunk #2029
Date Sat, 07 Feb 2015 14:09:42 GMT
See <https://builds.apache.org/job/Hadoop-Hdfs-trunk/2029/changes>

Changes:

[stevel] HADOOP-11535 TableMapping related tests failed due to 'successful' resolving of
invalid test hostname

[aajisaka] HDFS-7732. Fix the order of the parameters in DFSConfigKeys. Contributed by Brahma
Reddy Battula.

[jianhe] YARN-2694. Ensure only single node label specified in ResourceRequest. Contributed
by Wangda Tan

[jlowe] YARN-3089. LinuxContainerExecutor does not handle file arguments to deleteAsUser.
Contributed by Eric Payne

[jlowe] YARN-3144. Configuration for making delegation token failures to timeline server not-fatal.
Contributed by Jonathan Eagles

[stevel] HADOOP-11520. Clean incomplete multi-part uploads in S3A tests.  (Thomas Demoor via
stevel)

[aw] HADOOP-11485. Pluggable shell integration (aw)

[jlowe] YARN-3143. RM Apps REST API can return NPE or entries missing id and other fields.
Contributed by Jason Lowe

[arp] HDFS-7720. Quota by Storage Type API, tools and ClientNameNode Protocol changes. (Contributed
by Xiaoyu Yao)

[aajisaka] HDFS-7710. Remove dead code in BackupImage.java. Contributed by Xiaoyu Yao.

------------------------------------------
[...truncated 6257 lines...]
Tests run: 31, Failures: 0, Errors: 0, Skipped: 0, Time elapsed: 29.403 sec - in org.apache.hadoop.hdfs.TestDFSShell
Running org.apache.hadoop.hdfs.TestDatanodeReport
Tests run: 1, Failures: 0, Errors: 0, Skipped: 0, Time elapsed: 20.215 sec - in org.apache.hadoop.hdfs.TestDatanodeReport
Running org.apache.hadoop.hdfs.TestClientBlockVerification
Tests run: 4, Failures: 0, Errors: 0, Skipped: 0, Time elapsed: 4.823 sec - in org.apache.hadoop.hdfs.TestClientBlockVerification
Running org.apache.hadoop.hdfs.TestParallelReadUtil
Tests run: 1, Failures: 0, Errors: 0, Skipped: 1, Time elapsed: 0.039 sec - in org.apache.hadoop.hdfs.TestParallelReadUtil
Running org.apache.hadoop.hdfs.TestFileCreationClient
Tests run: 1, Failures: 0, Errors: 0, Skipped: 0, Time elapsed: 40.274 sec - in org.apache.hadoop.hdfs.TestFileCreationClient
Running org.apache.hadoop.hdfs.TestMiniDFSCluster
Tests run: 4, Failures: 0, Errors: 0, Skipped: 0, Time elapsed: 6.501 sec - in org.apache.hadoop.hdfs.TestMiniDFSCluster
Running org.apache.hadoop.hdfs.TestLocalDFS
Tests run: 2, Failures: 0, Errors: 0, Skipped: 0, Time elapsed: 5.884 sec - in org.apache.hadoop.hdfs.TestLocalDFS
Running org.apache.hadoop.hdfs.TestPeerCache
Tests run: 5, Failures: 0, Errors: 0, Skipped: 0, Time elapsed: 1.402 sec - in org.apache.hadoop.hdfs.TestPeerCache
Running org.apache.hadoop.hdfs.TestHFlush
Tests run: 14, Failures: 0, Errors: 0, Skipped: 0, Time elapsed: 30.348 sec - in org.apache.hadoop.hdfs.TestHFlush
Running org.apache.hadoop.hdfs.TestDFSFinalize
Tests run: 1, Failures: 0, Errors: 0, Skipped: 0, Time elapsed: 16.422 sec - in org.apache.hadoop.hdfs.TestDFSFinalize
Running org.apache.hadoop.hdfs.TestDatanodeRegistration
Tests run: 5, Failures: 0, Errors: 0, Skipped: 0, Time elapsed: 8.821 sec - in org.apache.hadoop.hdfs.TestDatanodeRegistration
Running org.apache.hadoop.hdfs.TestRenameWhileOpen
Tests run: 4, Failures: 0, Errors: 0, Skipped: 0, Time elapsed: 47.243 sec - in org.apache.hadoop.hdfs.TestRenameWhileOpen
Running org.apache.hadoop.hdfs.TestAbandonBlock
Tests run: 2, Failures: 0, Errors: 0, Skipped: 0, Time elapsed: 11.452 sec - in org.apache.hadoop.hdfs.TestAbandonBlock
Running org.apache.hadoop.hdfs.TestDFSRollback
Tests run: 1, Failures: 0, Errors: 0, Skipped: 0, Time elapsed: 13.404 sec - in org.apache.hadoop.hdfs.TestDFSRollback
Running org.apache.hadoop.hdfs.TestReservedRawPaths
Tests run: 8, Failures: 0, Errors: 0, Skipped: 0, Time elapsed: 9.473 sec - in org.apache.hadoop.hdfs.TestReservedRawPaths
Running org.apache.hadoop.hdfs.TestDatanodeStartupFixesLegacyStorageIDs
Tests run: 3, Failures: 0, Errors: 0, Skipped: 0, Time elapsed: 5.21 sec - in org.apache.hadoop.hdfs.TestDatanodeStartupFixesLegacyStorageIDs
Running org.apache.hadoop.hdfs.TestLeaseRecovery
Tests run: 2, Failures: 0, Errors: 0, Skipped: 0, Time elapsed: 18.69 sec - in org.apache.hadoop.hdfs.TestLeaseRecovery
Running org.apache.hadoop.hdfs.TestEncryptionZones
Tests run: 18, Failures: 0, Errors: 0, Skipped: 0, Time elapsed: 37.705 sec - in org.apache.hadoop.hdfs.TestEncryptionZones
Running org.apache.hadoop.hdfs.TestSmallBlock
Tests run: 2, Failures: 0, Errors: 0, Skipped: 0, Time elapsed: 5.388 sec - in org.apache.hadoop.hdfs.TestSmallBlock
Running org.apache.hadoop.hdfs.TestLeaseRecovery2
Tests run: 7, Failures: 0, Errors: 0, Skipped: 0, Time elapsed: 179.397 sec - in org.apache.hadoop.hdfs.TestLeaseRecovery2
Running org.apache.hadoop.hdfs.TestDFSMkdirs
Tests run: 3, Failures: 0, Errors: 0, Skipped: 0, Time elapsed: 6.187 sec - in org.apache.hadoop.hdfs.TestDFSMkdirs
Running org.apache.hadoop.hdfs.TestSetTimes
Tests run: 3, Failures: 0, Errors: 0, Skipped: 0, Time elapsed: 9.874 sec - in org.apache.hadoop.hdfs.TestSetTimes
Running org.apache.hadoop.hdfs.TestFileStatus
Tests run: 5, Failures: 0, Errors: 0, Skipped: 0, Time elapsed: 4.202 sec - in org.apache.hadoop.hdfs.TestFileStatus
Running org.apache.hadoop.hdfs.TestEncryptionZonesWithHA
Tests run: 1, Failures: 0, Errors: 0, Skipped: 0, Time elapsed: 6.033 sec - in org.apache.hadoop.hdfs.TestEncryptionZonesWithHA
Running org.apache.hadoop.hdfs.TestRollingUpgradeRollback
Tests run: 3, Failures: 0, Errors: 0, Skipped: 0, Time elapsed: 10.241 sec - in org.apache.hadoop.hdfs.TestRollingUpgradeRollback
Running org.apache.hadoop.hdfs.TestDFSStartupVersions
Tests run: 1, Failures: 0, Errors: 0, Skipped: 0, Time elapsed: 11.301 sec - in org.apache.hadoop.hdfs.TestDFSStartupVersions
Running org.apache.hadoop.hdfs.TestDFSShellGenericOptions
Tests run: 1, Failures: 0, Errors: 0, Skipped: 0, Time elapsed: 3.701 sec - in org.apache.hadoop.hdfs.TestDFSShellGenericOptions
Running org.apache.hadoop.hdfs.protocolPB.TestPBHelper
Tests run: 28, Failures: 0, Errors: 0, Skipped: 0, Time elapsed: 0.923 sec - in org.apache.hadoop.hdfs.protocolPB.TestPBHelper
Running org.apache.hadoop.hdfs.TestLeaseRenewer
Tests run: 4, Failures: 0, Errors: 0, Skipped: 0, Time elapsed: 1.417 sec - in org.apache.hadoop.hdfs.TestLeaseRenewer
Running org.apache.hadoop.hdfs.TestDFSRemove
Tests run: 1, Failures: 0, Errors: 0, Skipped: 0, Time elapsed: 15.218 sec - in org.apache.hadoop.hdfs.TestDFSRemove
Running org.apache.hadoop.hdfs.TestFileAppend4
Tests run: 4, Failures: 0, Errors: 0, Skipped: 0, Time elapsed: 30.011 sec - in org.apache.hadoop.hdfs.TestFileAppend4
Running org.apache.hadoop.hdfs.TestParallelRead
Tests run: 4, Failures: 0, Errors: 0, Skipped: 0, Time elapsed: 38.903 sec - in org.apache.hadoop.hdfs.TestParallelRead
Running org.apache.hadoop.hdfs.TestClose
Tests run: 1, Failures: 0, Errors: 0, Skipped: 0, Time elapsed: 4.162 sec - in org.apache.hadoop.hdfs.TestClose
Running org.apache.hadoop.hdfs.TestDFSAddressConfig
Tests run: 1, Failures: 0, Errors: 0, Skipped: 0, Time elapsed: 4.438 sec - in org.apache.hadoop.hdfs.TestDFSAddressConfig
Running org.apache.hadoop.hdfs.TestParallelShortCircuitLegacyRead
Tests run: 4, Failures: 0, Errors: 0, Skipped: 0, Time elapsed: 15.139 sec - in org.apache.hadoop.hdfs.TestParallelShortCircuitLegacyRead
Running org.apache.hadoop.hdfs.TestLargeBlock
Tests run: 1, Failures: 0, Errors: 0, Skipped: 0, Time elapsed: 13.432 sec - in org.apache.hadoop.hdfs.TestLargeBlock
Running org.apache.hadoop.hdfs.TestHDFSTrash
Tests run: 2, Failures: 0, Errors: 0, Skipped: 0, Time elapsed: 5.724 sec - in org.apache.hadoop.hdfs.TestHDFSTrash
Running org.apache.hadoop.hdfs.TestClientReportBadBlock
Tests run: 3, Failures: 0, Errors: 0, Skipped: 0, Time elapsed: 7.964 sec - in org.apache.hadoop.hdfs.TestClientReportBadBlock
Running org.apache.hadoop.hdfs.TestWriteRead
Tests run: 3, Failures: 0, Errors: 0, Skipped: 0, Time elapsed: 25.22 sec - in org.apache.hadoop.hdfs.TestWriteRead
Running org.apache.hadoop.hdfs.TestClientProtocolForPipelineRecovery
Tests run: 4, Failures: 0, Errors: 0, Skipped: 0, Time elapsed: 33.522 sec - in org.apache.hadoop.hdfs.TestClientProtocolForPipelineRecovery
Running org.apache.hadoop.hdfs.TestBalancerBandwidth
Tests run: 1, Failures: 0, Errors: 0, Skipped: 0, Time elapsed: 13.604 sec - in org.apache.hadoop.hdfs.TestBalancerBandwidth
Running org.apache.hadoop.hdfs.TestDFSUpgrade
Tests run: 2, Failures: 0, Errors: 0, Skipped: 0, Time elapsed: 13.873 sec - in org.apache.hadoop.hdfs.TestDFSUpgrade
Running org.apache.hadoop.hdfs.TestBlockStoragePolicy
Tests run: 16, Failures: 0, Errors: 0, Skipped: 0, Time elapsed: 34.855 sec - in org.apache.hadoop.hdfs.TestBlockStoragePolicy
Running org.apache.hadoop.hdfs.TestFileLengthOnClusterRestart
Tests run: 1, Failures: 0, Errors: 0, Skipped: 0, Time elapsed: 10.895 sec - in org.apache.hadoop.hdfs.TestFileLengthOnClusterRestart
Running org.apache.hadoop.hdfs.TestBlockReaderFactory
Tests run: 7, Failures: 0, Errors: 0, Skipped: 0, Time elapsed: 11.347 sec - in org.apache.hadoop.hdfs.TestBlockReaderFactory
Running org.apache.hadoop.hdfs.qjournal.TestSecureNNWithQJM
Tests run: 2, Failures: 0, Errors: 0, Skipped: 0, Time elapsed: 47.838 sec - in org.apache.hadoop.hdfs.qjournal.TestSecureNNWithQJM
Running org.apache.hadoop.hdfs.qjournal.TestNNWithQJM
Tests run: 3, Failures: 0, Errors: 0, Skipped: 0, Time elapsed: 7.305 sec - in org.apache.hadoop.hdfs.qjournal.TestNNWithQJM
Running org.apache.hadoop.hdfs.qjournal.server.TestJournalNodeMXBean
Tests run: 1, Failures: 0, Errors: 0, Skipped: 0, Time elapsed: 1.868 sec - in org.apache.hadoop.hdfs.qjournal.server.TestJournalNodeMXBean
Running org.apache.hadoop.hdfs.qjournal.server.TestJournal
Tests run: 12, Failures: 0, Errors: 0, Skipped: 0, Time elapsed: 1.905 sec - in org.apache.hadoop.hdfs.qjournal.server.TestJournal
Running org.apache.hadoop.hdfs.qjournal.server.TestJournalNode
Tests run: 6, Failures: 0, Errors: 0, Skipped: 0, Time elapsed: 11.255 sec - in org.apache.hadoop.hdfs.qjournal.server.TestJournalNode
Running org.apache.hadoop.hdfs.qjournal.client.TestIPCLoggerChannel
Tests run: 3, Failures: 0, Errors: 0, Skipped: 0, Time elapsed: 1.254 sec - in org.apache.hadoop.hdfs.qjournal.client.TestIPCLoggerChannel
Running org.apache.hadoop.hdfs.qjournal.client.TestQJMWithFaults
Tests run: 2, Failures: 0, Errors: 0, Skipped: 0, Time elapsed: 148.807 sec - in org.apache.hadoop.hdfs.qjournal.client.TestQJMWithFaults
Running org.apache.hadoop.hdfs.qjournal.client.TestEpochsAreUnique
Tests run: 1, Failures: 0, Errors: 0, Skipped: 0, Time elapsed: 6.664 sec - in org.apache.hadoop.hdfs.qjournal.client.TestEpochsAreUnique
Running org.apache.hadoop.hdfs.qjournal.client.TestQuorumJournalManagerUnit
Tests run: 6, Failures: 0, Errors: 0, Skipped: 0, Time elapsed: 1.635 sec - in org.apache.hadoop.hdfs.qjournal.client.TestQuorumJournalManagerUnit
Running org.apache.hadoop.hdfs.qjournal.client.TestSegmentRecoveryComparator
Tests run: 1, Failures: 0, Errors: 0, Skipped: 0, Time elapsed: 0.298 sec - in org.apache.hadoop.hdfs.qjournal.client.TestSegmentRecoveryComparator
Running org.apache.hadoop.hdfs.qjournal.client.TestQuorumCall
Tests run: 1, Failures: 0, Errors: 0, Skipped: 0, Time elapsed: 0.269 sec - in org.apache.hadoop.hdfs.qjournal.client.TestQuorumCall
Running org.apache.hadoop.hdfs.qjournal.client.TestQuorumJournalManager
Tests run: 21, Failures: 0, Errors: 0, Skipped: 0, Time elapsed: 20.661 sec - in org.apache.hadoop.hdfs.qjournal.client.TestQuorumJournalManager
Running org.apache.hadoop.hdfs.qjournal.TestMiniJournalCluster
Tests run: 1, Failures: 0, Errors: 0, Skipped: 0, Time elapsed: 1.913 sec - in org.apache.hadoop.hdfs.qjournal.TestMiniJournalCluster
Running org.apache.hadoop.hdfs.TestFileCreationEmpty
Tests run: 1, Failures: 0, Errors: 0, Skipped: 0, Time elapsed: 9.036 sec - in org.apache.hadoop.hdfs.TestFileCreationEmpty
Running org.apache.hadoop.hdfs.TestBlockMissingException
Tests run: 1, Failures: 0, Errors: 0, Skipped: 0, Time elapsed: 4.525 sec - in org.apache.hadoop.hdfs.TestBlockMissingException
Running org.apache.hadoop.hdfs.TestDataTransferKeepalive
Tests run: 4, Failures: 0, Errors: 0, Skipped: 0, Time elapsed: 15.943 sec - in org.apache.hadoop.hdfs.TestDataTransferKeepalive
Running org.apache.hadoop.hdfs.TestModTime
Tests run: 2, Failures: 0, Errors: 0, Skipped: 0, Time elapsed: 12.24 sec - in org.apache.hadoop.hdfs.TestModTime
Running org.apache.hadoop.hdfs.TestRollingUpgradeDowngrade
Tests run: 2, Failures: 0, Errors: 0, Skipped: 0, Time elapsed: 8.508 sec - in org.apache.hadoop.hdfs.TestRollingUpgradeDowngrade
Running org.apache.hadoop.hdfs.TestLease
Tests run: 5, Failures: 0, Errors: 0, Skipped: 0, Time elapsed: 9.102 sec - in org.apache.hadoop.hdfs.TestLease
Running org.apache.hadoop.hdfs.TestParallelUnixDomainRead
Tests run: 4, Failures: 0, Errors: 0, Skipped: 0, Time elapsed: 38.571 sec - in org.apache.hadoop.hdfs.TestParallelUnixDomainRead
Running org.apache.hadoop.hdfs.TestDeprecatedKeys
Tests run: 1, Failures: 0, Errors: 0, Skipped: 0, Time elapsed: 0.561 sec - in org.apache.hadoop.hdfs.TestDeprecatedKeys
Running org.apache.hadoop.hdfs.TestFSOutputSummer
Tests run: 2, Failures: 0, Errors: 0, Skipped: 0, Time elapsed: 7.799 sec - in org.apache.hadoop.hdfs.TestFSOutputSummer
Running org.apache.hadoop.hdfs.TestRead
Tests run: 3, Failures: 0, Errors: 0, Skipped: 0, Time elapsed: 5.904 sec - in org.apache.hadoop.hdfs.TestRead
Running org.apache.hadoop.hdfs.TestDFSInotifyEventInputStream
Tests run: 5, Failures: 0, Errors: 0, Skipped: 0, Time elapsed: 18.603 sec - in org.apache.hadoop.hdfs.TestDFSInotifyEventInputStream
Running org.apache.hadoop.hdfs.TestCrcCorruption
Tests run: 4, Failures: 0, Errors: 0, Skipped: 0, Time elapsed: 15.435 sec - in org.apache.hadoop.hdfs.TestCrcCorruption
Running org.apache.hadoop.hdfs.TestGetBlocks
Tests run: 3, Failures: 0, Errors: 0, Skipped: 0, Time elapsed: 48.388 sec - in org.apache.hadoop.hdfs.TestGetBlocks
Running org.apache.hadoop.hdfs.TestDataTransferProtocol
Tests run: 3, Failures: 0, Errors: 0, Skipped: 0, Time elapsed: 5.728 sec - in org.apache.hadoop.hdfs.TestDataTransferProtocol
Running org.apache.hadoop.hdfs.TestReadWhileWriting
Tests run: 1, Failures: 0, Errors: 0, Skipped: 0, Time elapsed: 6.522 sec - in org.apache.hadoop.hdfs.TestReadWhileWriting
Running org.apache.hadoop.net.TestNetworkTopology
Tests run: 10, Failures: 0, Errors: 0, Skipped: 0, Time elapsed: 8.932 sec - in org.apache.hadoop.net.TestNetworkTopology
Running org.apache.hadoop.tracing.TestTraceAdmin
Tests run: 1, Failures: 0, Errors: 0, Skipped: 0, Time elapsed: 4.042 sec - in org.apache.hadoop.tracing.TestTraceAdmin
Running org.apache.hadoop.tracing.TestTracingShortCircuitLocalRead
Tests run: 1, Failures: 0, Errors: 0, Skipped: 0, Time elapsed: 4.582 sec - in org.apache.hadoop.tracing.TestTracingShortCircuitLocalRead
Running org.apache.hadoop.tracing.TestTracing
Tests run: 5, Failures: 0, Errors: 0, Skipped: 0, Time elapsed: 5.08 sec - in org.apache.hadoop.tracing.TestTracing
Running org.apache.hadoop.TestRefreshCallQueue
Tests run: 1, Failures: 0, Errors: 0, Skipped: 0, Time elapsed: 3.93 sec - in org.apache.hadoop.TestRefreshCallQueue

Results :

Failed tests: 
  TestHDFSCLI.tearDown:85->CLITestHelper.tearDown:125->CLITestHelper.displayResults:263
One of the tests failed. See the Detailed results to identify the command that failed

Tests run: 3237, Failures: 1, Errors: 0, Skipped: 17

[INFO]                                                                         
[INFO] ------------------------------------------------------------------------
[INFO] Skipping Apache Hadoop HttpFS
[INFO] This project has been banned from the build due to previous failures.
[INFO] ------------------------------------------------------------------------
[INFO]                                                                         
[INFO] ------------------------------------------------------------------------
[INFO] Skipping Apache Hadoop HDFS BookKeeper Journal
[INFO] This project has been banned from the build due to previous failures.
[INFO] ------------------------------------------------------------------------
[INFO]                                                                         
[INFO] ------------------------------------------------------------------------
[INFO] Skipping Apache Hadoop HDFS-NFS
[INFO] This project has been banned from the build due to previous failures.
[INFO] ------------------------------------------------------------------------
[INFO]                                                                         
[INFO] ------------------------------------------------------------------------
[INFO] Building Apache Hadoop HDFS Project 3.0.0-SNAPSHOT
[INFO] ------------------------------------------------------------------------
[WARNING] The POM for org.eclipse.m2e:lifecycle-mapping:jar:1.0.0 is missing, no dependency
information available
[WARNING] Failed to retrieve plugin descriptor for org.eclipse.m2e:lifecycle-mapping:1.0.0:
Plugin org.eclipse.m2e:lifecycle-mapping:1.0.0 or one of its dependencies could not be resolved:
Failure to find org.eclipse.m2e:lifecycle-mapping:jar:1.0.0 in http://repo.maven.apache.org/maven2
was cached in the local repository, resolution will not be reattempted until the update interval
of central has elapsed or updates are forced
[INFO] 
[INFO] --- maven-clean-plugin:2.5:clean (default-clean) @ hadoop-hdfs-project ---
[INFO] Deleting <https://builds.apache.org/job/Hadoop-Hdfs-trunk/ws/hadoop-hdfs-project/target>
[INFO] 
[INFO] --- maven-antrun-plugin:1.7:run (create-testdirs) @ hadoop-hdfs-project ---
[INFO] Executing tasks

main:
    [mkdir] Created dir: <https://builds.apache.org/job/Hadoop-Hdfs-trunk/ws/hadoop-hdfs-project/target/test-dir>
[INFO] Executed tasks
[INFO] 
[INFO] --- maven-source-plugin:2.3:jar-no-fork (hadoop-java-sources) @ hadoop-hdfs-project
---
[INFO] 
[INFO] --- maven-source-plugin:2.3:test-jar-no-fork (hadoop-java-sources) @ hadoop-hdfs-project
---
[INFO] 
[INFO] --- maven-enforcer-plugin:1.3.1:enforce (dist-enforce) @ hadoop-hdfs-project ---
[INFO] 
[INFO] --- maven-site-plugin:3.4:attach-descriptor (attach-descriptor) @ hadoop-hdfs-project
---
[INFO] 
[INFO] --- maven-javadoc-plugin:2.8.1:jar (module-javadocs) @ hadoop-hdfs-project ---
[INFO] Skipping javadoc generation
[INFO] 
[INFO] --- maven-enforcer-plugin:1.3.1:enforce (depcheck) @ hadoop-hdfs-project ---
[INFO] 
[INFO] --- maven-checkstyle-plugin:2.12.1:checkstyle (default-cli) @ hadoop-hdfs-project ---
[INFO] 
[INFO] --- findbugs-maven-plugin:3.0.0:findbugs (default-cli) @ hadoop-hdfs-project ---
[INFO] ------------------------------------------------------------------------
[INFO] Reactor Summary:
[INFO] 
[INFO] Apache Hadoop HDFS ................................ FAILURE [  02:34 h]
[INFO] Apache Hadoop HttpFS .............................. SKIPPED
[INFO] Apache Hadoop HDFS BookKeeper Journal ............. SKIPPED
[INFO] Apache Hadoop HDFS-NFS ............................ SKIPPED
[INFO] Apache Hadoop HDFS Project ........................ SUCCESS [  2.455 s]
[INFO] ------------------------------------------------------------------------
[INFO] BUILD FAILURE
[INFO] ------------------------------------------------------------------------
[INFO] Total time: 02:35 h
[INFO] Finished at: 2015-02-07T14:09:16+00:00
[INFO] Final Memory: 48M/800M
[INFO] ------------------------------------------------------------------------
[ERROR] Failed to execute goal org.apache.maven.plugins:maven-surefire-plugin:2.17:test (default-test)
on project hadoop-hdfs: There are test failures.
[ERROR] 
[ERROR] Please refer to <https://builds.apache.org/job/Hadoop-Hdfs-trunk/ws/hadoop-hdfs-project/hadoop-hdfs/target/surefire-reports>
for the individual test results.
[ERROR] -> [Help 1]
[ERROR] 
[ERROR] To see the full stack trace of the errors, re-run Maven with the -e switch.
[ERROR] Re-run Maven using the -X switch to enable full debug logging.
[ERROR] 
[ERROR] For more information about the errors and possible solutions, please read the following
articles:
[ERROR] [Help 1] http://cwiki.apache.org/confluence/display/MAVEN/MojoFailureException
Build step 'Execute shell' marked build as failure
Archiving artifacts
Recording test results
Updating YARN-3089
Updating HDFS-7732
Updating HADOOP-11485
Updating HDFS-7710
Updating HDFS-7720
Updating HADOOP-11520
Updating HADOOP-11535
Error updating JIRA issues. Saving issues for next build.
java.io.IOException: java.lang.IllegalArgumentException: The char '0x16' after 'FAILURE: Integrated
in Hadoop-Hdfs-trunk #2029 (See [https://builds.apache.org/job/Hadoop-Hdfs-trunk/2029/])
' is not a valid XML character.

Mime
View raw message