hadoop-hdfs-dev mailing list archives

Site index · List index
Message view « Date » · « Thread »
Top « Date » · « Thread »
From Apache Jenkins Server <jenk...@builds.apache.org>
Subject Hadoop-Hdfs-trunk - Build # 2032 - Still Failing
Date Tue, 10 Feb 2015 12:57:02 GMT
See https://builds.apache.org/job/Hadoop-Hdfs-trunk/2032/

###################################################################################
########################## LAST 60 LINES OF THE CONSOLE ###########################
[...truncated 5966 lines...]
[INFO] --- maven-enforcer-plugin:1.3.1:enforce (dist-enforce) @ hadoop-hdfs-project ---
[INFO] 
[INFO] --- maven-site-plugin:3.4:attach-descriptor (attach-descriptor) @ hadoop-hdfs-project
---
[INFO] 
[INFO] --- maven-javadoc-plugin:2.8.1:jar (module-javadocs) @ hadoop-hdfs-project ---
[INFO] Skipping javadoc generation
[INFO] 
[INFO] --- maven-enforcer-plugin:1.3.1:enforce (depcheck) @ hadoop-hdfs-project ---
[INFO] 
[INFO] --- maven-checkstyle-plugin:2.12.1:checkstyle (default-cli) @ hadoop-hdfs-project ---
[INFO] 
[INFO] --- findbugs-maven-plugin:3.0.0:findbugs (default-cli) @ hadoop-hdfs-project ---
[INFO] ------------------------------------------------------------------------
[INFO] Reactor Summary:
[INFO] 
[INFO] Apache Hadoop HDFS ................................ FAILURE [  01:22 h]
[INFO] Apache Hadoop HttpFS .............................. SKIPPED
[INFO] Apache Hadoop HDFS BookKeeper Journal ............. SKIPPED
[INFO] Apache Hadoop HDFS-NFS ............................ SKIPPED
[INFO] Apache Hadoop HDFS Project ........................ SUCCESS [  3.551 s]
[INFO] ------------------------------------------------------------------------
[INFO] BUILD FAILURE
[INFO] ------------------------------------------------------------------------
[INFO] Total time: 01:22 h
[INFO] Finished at: 2015-02-10T12:56:25+00:00
[INFO] Final Memory: 70M/1101M
[INFO] ------------------------------------------------------------------------
[ERROR] Failed to execute goal org.apache.maven.plugins:maven-surefire-plugin:2.17:test (default-test)
on project hadoop-hdfs: ExecutionException: java.lang.RuntimeException: The forked VM terminated
without properly saying goodbye. VM crash or System.exit called?
[ERROR] Command was /bin/sh -c cd /home/jenkins/jenkins-slave/workspace/Hadoop-Hdfs-trunk/hadoop-hdfs-project/hadoop-hdfs
&& /home/jenkins/tools/java/jdk1.7.0_55/jre/bin/java -Xmx4096m -XX:MaxPermSize=768m
-XX:+HeapDumpOnOutOfMemoryError -jar /home/jenkins/jenkins-slave/workspace/Hadoop-Hdfs-trunk/hadoop-hdfs-project/hadoop-hdfs/target/surefire/surefirebooter7806822997809562769.jar
/home/jenkins/jenkins-slave/workspace/Hadoop-Hdfs-trunk/hadoop-hdfs-project/hadoop-hdfs/target/surefire/surefire1453576331401042693tmp
/home/jenkins/jenkins-slave/workspace/Hadoop-Hdfs-trunk/hadoop-hdfs-project/hadoop-hdfs/target/surefire/surefire_799037144837106358193tmp
[ERROR] -> [Help 1]
[ERROR] 
[ERROR] To see the full stack trace of the errors, re-run Maven with the -e switch.
[ERROR] Re-run Maven using the -X switch to enable full debug logging.
[ERROR] 
[ERROR] For more information about the errors and possible solutions, please read the following
articles:
[ERROR] [Help 1] http://cwiki.apache.org/confluence/display/MAVEN/MojoFailureException
Build step 'Execute shell' marked build as failure
Archiving artifacts
Recording test results
Updating HADOOP-11512
Updating YARN-3100
Updating HADOOP-11510
Updating YARN-3094
Updating YARN-2971
Updating HADOOP-8934
Updating HDFS-7670
Updating HDFS-7756
Updating HDFS-7755
Updating HDFS-7058
Updating HDFS-7714
Updating HDFS-7669
Updating HDFS-7744
Updating HDFS-7546
Updating MAPREDUCE-4413
Updating YARN-3155
Updating HDFS-7718
Sending e-mails to: hdfs-dev@hadoop.apache.org
Email was triggered for: Failure
Sending email for trigger: Failure



###################################################################################
############################## FAILED TESTS (if any) ##############################
1 tests failed.
REGRESSION:  org.apache.hadoop.hdfs.server.datanode.TestFsDatasetCache.testPageRounder

Error Message:

Unfinished stubbing detected here:
-> at org.apache.hadoop.hdfs.server.datanode.TestFsDatasetCache.setHeartbeatResponse(TestFsDatasetCache.java:162)

E.g. thenReturn() may be missing.
Examples of correct stubbing:
    when(mock.isOk()).thenReturn(true);
    when(mock.isOk()).thenThrow(exception);
    doThrow(exception).when(mock).someVoidMethod();
Hints:
 1. missing thenReturn()
 2. although stubbed methods may return mocks, you cannot inline mock creation (mock()) call
inside a thenReturn method (see issue 53)


Stack Trace:
org.mockito.exceptions.misusing.UnfinishedStubbingException: 
Unfinished stubbing detected here:
-> at org.apache.hadoop.hdfs.server.datanode.TestFsDatasetCache.setHeartbeatResponse(TestFsDatasetCache.java:162)

E.g. thenReturn() may be missing.
Examples of correct stubbing:
    when(mock.isOk()).thenReturn(true);
    when(mock.isOk()).thenThrow(exception);
    doThrow(exception).when(mock).someVoidMethod();
Hints:
 1. missing thenReturn()
 2. although stubbed methods may return mocks, you cannot inline mock creation (mock()) call
inside a thenReturn method (see issue 53)

	at org.apache.hadoop.hdfs.server.datanode.TestFsDatasetCache.setHeartbeatResponse(TestFsDatasetCache.java:162)
	at org.apache.hadoop.hdfs.server.datanode.TestFsDatasetCache.testPageRounder(TestFsDatasetCache.java:465)



Mime
  • Unnamed multipart/mixed (inline, None, 0 bytes)
View raw message