hadoop-hdfs-dev mailing list archives

Site index · List index
Message view « Date » · « Thread »
Top « Date » · « Thread »
From Apache Jenkins Server <jenk...@builds.apache.org>
Subject Build failed in Jenkins: Hadoop-Hdfs-trunk-Java8 #69
Date Tue, 13 Jan 2015 14:35:55 GMT
See <https://builds.apache.org/job/Hadoop-Hdfs-trunk-Java8/69/changes>

Changes:

[rkanter] YARN-3027. Scheduler should use totalAvailable resource from node instead of availableResource
for maxAllocation. (adhoot via rkanter)

[rkanter] YARN-2957. Create unit test to automatically compare YarnConfiguration and yarn-default.xml.
(rchiang via rkanter)

[cmccabe] HDFS-7326. Add documentation for hdfs debug commands (Vijay Bhat via Colin P. McCabe)

[kihwal] HDFS-7533. Datanode sometimes does not shutdown on receiving upgrade shutdown command.
Contributed by Eric Payne.

[raviprak] HADOOP-11473. test-patch says "-1 overall" even when all checks are +1

[cmccabe] HDFS-7598. Remove dependency on old version of Guava in TestDFSClientCache#testEviction
(Sangjin Lee via Colin P. McCabe)

[cmccabe] HDFS-5445. PacketReceiver populates the packetLen field in PacketHeader incorrectly
(Jonathan Mace via Colin P. McCabe)

[jing9] HDFS-7600. Refine hdfs admin classes to reuse common code. Contributed by Jing Zhao.

[rkanter] YARN-2643. Don't create a new DominantResourceCalculator on every FairScheduler.allocate
call. (kasha via rkanter)

[arp] HADOOP-11465. Fix findbugs warnings in hadoop-gridmix. (Contributed by Varun Saxena)

[shv] HDFS-3107. Introduce truncate. Contributed by Plamen Jeliazkov.

[shv] HDFS-7056. Snapshot support for truncate. Contributed by Konstantin Shvachko and Plamen
Jeliazkov.

------------------------------------------
[...truncated 7199 lines...]
Java HotSpot(TM) 64-Bit Server VM warning: ignoring option MaxPermSize=768m; support was removed
in 8.0
Running org.apache.hadoop.hdfs.TestLeaseRenewer
Tests run: 4, Failures: 0, Errors: 0, Skipped: 0, Time elapsed: 1.206 sec - in org.apache.hadoop.hdfs.TestLeaseRenewer
Java HotSpot(TM) 64-Bit Server VM warning: ignoring option MaxPermSize=768m; support was removed
in 8.0
Running org.apache.hadoop.hdfs.TestDatanodeBlockScanner
Tests run: 7, Failures: 0, Errors: 0, Skipped: 0, Time elapsed: 213.477 sec - in org.apache.hadoop.hdfs.TestDatanodeBlockScanner
Java HotSpot(TM) 64-Bit Server VM warning: ignoring option MaxPermSize=768m; support was removed
in 8.0
Running org.apache.hadoop.hdfs.TestDFSRemove
Tests run: 1, Failures: 0, Errors: 0, Skipped: 0, Time elapsed: 14.628 sec - in org.apache.hadoop.hdfs.TestDFSRemove
Java HotSpot(TM) 64-Bit Server VM warning: ignoring option MaxPermSize=768m; support was removed
in 8.0
Running org.apache.hadoop.hdfs.TestFileAppend4
Tests run: 4, Failures: 0, Errors: 0, Skipped: 0, Time elapsed: 31.187 sec - in org.apache.hadoop.hdfs.TestFileAppend4
Java HotSpot(TM) 64-Bit Server VM warning: ignoring option MaxPermSize=768m; support was removed
in 8.0
Running org.apache.hadoop.hdfs.TestParallelRead
Tests run: 4, Failures: 0, Errors: 0, Skipped: 0, Time elapsed: 32.368 sec - in org.apache.hadoop.hdfs.TestParallelRead
Java HotSpot(TM) 64-Bit Server VM warning: ignoring option MaxPermSize=768m; support was removed
in 8.0
Running org.apache.hadoop.hdfs.TestClose
Tests run: 1, Failures: 0, Errors: 0, Skipped: 0, Time elapsed: 3.964 sec - in org.apache.hadoop.hdfs.TestClose
Java HotSpot(TM) 64-Bit Server VM warning: ignoring option MaxPermSize=768m; support was removed
in 8.0
Running org.apache.hadoop.hdfs.TestDFSAddressConfig
Tests run: 1, Failures: 0, Errors: 0, Skipped: 0, Time elapsed: 4.658 sec - in org.apache.hadoop.hdfs.TestDFSAddressConfig
Java HotSpot(TM) 64-Bit Server VM warning: ignoring option MaxPermSize=768m; support was removed
in 8.0
Running org.apache.hadoop.hdfs.TestParallelShortCircuitLegacyRead
Tests run: 4, Failures: 0, Errors: 0, Skipped: 0, Time elapsed: 12.809 sec - in org.apache.hadoop.hdfs.TestParallelShortCircuitLegacyRead
Java HotSpot(TM) 64-Bit Server VM warning: ignoring option MaxPermSize=768m; support was removed
in 8.0
Running org.apache.hadoop.hdfs.TestLargeBlock
Tests run: 1, Failures: 0, Errors: 0, Skipped: 0, Time elapsed: 13.141 sec - in org.apache.hadoop.hdfs.TestLargeBlock
Java HotSpot(TM) 64-Bit Server VM warning: ignoring option MaxPermSize=768m; support was removed
in 8.0
Running org.apache.hadoop.hdfs.TestHDFSTrash
Tests run: 2, Failures: 0, Errors: 0, Skipped: 0, Time elapsed: 5.683 sec - in org.apache.hadoop.hdfs.TestHDFSTrash
Java HotSpot(TM) 64-Bit Server VM warning: ignoring option MaxPermSize=768m; support was removed
in 8.0
Running org.apache.hadoop.hdfs.TestClientReportBadBlock
Tests run: 3, Failures: 0, Errors: 0, Skipped: 0, Time elapsed: 9.085 sec - in org.apache.hadoop.hdfs.TestClientReportBadBlock
Java HotSpot(TM) 64-Bit Server VM warning: ignoring option MaxPermSize=768m; support was removed
in 8.0
Running org.apache.hadoop.hdfs.TestWriteRead
Tests run: 3, Failures: 0, Errors: 0, Skipped: 0, Time elapsed: 21.099 sec - in org.apache.hadoop.hdfs.TestWriteRead
Java HotSpot(TM) 64-Bit Server VM warning: ignoring option MaxPermSize=768m; support was removed
in 8.0
Running org.apache.hadoop.hdfs.TestClientProtocolForPipelineRecovery
Tests run: 4, Failures: 0, Errors: 0, Skipped: 0, Time elapsed: 34.477 sec - in org.apache.hadoop.hdfs.TestClientProtocolForPipelineRecovery
Java HotSpot(TM) 64-Bit Server VM warning: ignoring option MaxPermSize=768m; support was removed
in 8.0
Running org.apache.hadoop.hdfs.TestBalancerBandwidth
Tests run: 1, Failures: 0, Errors: 0, Skipped: 0, Time elapsed: 13.743 sec - in org.apache.hadoop.hdfs.TestBalancerBandwidth
Java HotSpot(TM) 64-Bit Server VM warning: ignoring option MaxPermSize=768m; support was removed
in 8.0
Running org.apache.hadoop.hdfs.TestDFSUpgrade
Tests run: 2, Failures: 0, Errors: 0, Skipped: 0, Time elapsed: 14.998 sec - in org.apache.hadoop.hdfs.TestDFSUpgrade
Java HotSpot(TM) 64-Bit Server VM warning: ignoring option MaxPermSize=768m; support was removed
in 8.0
Running org.apache.hadoop.hdfs.TestBlockStoragePolicy
Tests run: 16, Failures: 0, Errors: 0, Skipped: 0, Time elapsed: 36.837 sec - in org.apache.hadoop.hdfs.TestBlockStoragePolicy
Java HotSpot(TM) 64-Bit Server VM warning: ignoring option MaxPermSize=768m; support was removed
in 8.0
Running org.apache.hadoop.hdfs.TestFileLengthOnClusterRestart
Tests run: 1, Failures: 0, Errors: 0, Skipped: 0, Time elapsed: 10.497 sec - in org.apache.hadoop.hdfs.TestFileLengthOnClusterRestart
Java HotSpot(TM) 64-Bit Server VM warning: ignoring option MaxPermSize=768m; support was removed
in 8.0
Running org.apache.hadoop.hdfs.TestBlockReaderFactory
Tests run: 7, Failures: 0, Errors: 0, Skipped: 0, Time elapsed: 12.315 sec - in org.apache.hadoop.hdfs.TestBlockReaderFactory
Java HotSpot(TM) 64-Bit Server VM warning: ignoring option MaxPermSize=768m; support was removed
in 8.0
Running org.apache.hadoop.hdfs.qjournal.TestSecureNNWithQJM
Tests run: 2, Failures: 0, Errors: 0, Skipped: 0, Time elapsed: 36.839 sec - in org.apache.hadoop.hdfs.qjournal.TestSecureNNWithQJM
Java HotSpot(TM) 64-Bit Server VM warning: ignoring option MaxPermSize=768m; support was removed
in 8.0
Running org.apache.hadoop.hdfs.qjournal.TestNNWithQJM
Tests run: 3, Failures: 0, Errors: 0, Skipped: 0, Time elapsed: 8.122 sec - in org.apache.hadoop.hdfs.qjournal.TestNNWithQJM
Java HotSpot(TM) 64-Bit Server VM warning: ignoring option MaxPermSize=768m; support was removed
in 8.0
Running org.apache.hadoop.hdfs.qjournal.server.TestJournalNodeMXBean
Tests run: 1, Failures: 0, Errors: 0, Skipped: 0, Time elapsed: 1.334 sec - in org.apache.hadoop.hdfs.qjournal.server.TestJournalNodeMXBean
Java HotSpot(TM) 64-Bit Server VM warning: ignoring option MaxPermSize=768m; support was removed
in 8.0
Running org.apache.hadoop.hdfs.qjournal.server.TestJournal
Tests run: 12, Failures: 0, Errors: 0, Skipped: 0, Time elapsed: 1.457 sec - in org.apache.hadoop.hdfs.qjournal.server.TestJournal
Java HotSpot(TM) 64-Bit Server VM warning: ignoring option MaxPermSize=768m; support was removed
in 8.0
Running org.apache.hadoop.hdfs.qjournal.server.TestJournalNode
Tests run: 6, Failures: 0, Errors: 0, Skipped: 0, Time elapsed: 13.323 sec - in org.apache.hadoop.hdfs.qjournal.server.TestJournalNode
Java HotSpot(TM) 64-Bit Server VM warning: ignoring option MaxPermSize=768m; support was removed
in 8.0
Running org.apache.hadoop.hdfs.qjournal.client.TestIPCLoggerChannel
Tests run: 3, Failures: 0, Errors: 0, Skipped: 0, Time elapsed: 0.857 sec - in org.apache.hadoop.hdfs.qjournal.client.TestIPCLoggerChannel
Java HotSpot(TM) 64-Bit Server VM warning: ignoring option MaxPermSize=768m; support was removed
in 8.0
Running org.apache.hadoop.hdfs.qjournal.client.TestQJMWithFaults
Tests run: 2, Failures: 0, Errors: 0, Skipped: 0, Time elapsed: 142.997 sec - in org.apache.hadoop.hdfs.qjournal.client.TestQJMWithFaults
Java HotSpot(TM) 64-Bit Server VM warning: ignoring option MaxPermSize=768m; support was removed
in 8.0
Running org.apache.hadoop.hdfs.qjournal.client.TestEpochsAreUnique
Tests run: 1, Failures: 0, Errors: 0, Skipped: 0, Time elapsed: 7.481 sec - in org.apache.hadoop.hdfs.qjournal.client.TestEpochsAreUnique
Java HotSpot(TM) 64-Bit Server VM warning: ignoring option MaxPermSize=768m; support was removed
in 8.0
Running org.apache.hadoop.hdfs.qjournal.client.TestQuorumJournalManagerUnit
Tests run: 6, Failures: 0, Errors: 0, Skipped: 0, Time elapsed: 1.165 sec - in org.apache.hadoop.hdfs.qjournal.client.TestQuorumJournalManagerUnit
Java HotSpot(TM) 64-Bit Server VM warning: ignoring option MaxPermSize=768m; support was removed
in 8.0
Running org.apache.hadoop.hdfs.qjournal.client.TestSegmentRecoveryComparator
Tests run: 1, Failures: 0, Errors: 0, Skipped: 0, Time elapsed: 0.249 sec - in org.apache.hadoop.hdfs.qjournal.client.TestSegmentRecoveryComparator
Java HotSpot(TM) 64-Bit Server VM warning: ignoring option MaxPermSize=768m; support was removed
in 8.0
Running org.apache.hadoop.hdfs.qjournal.client.TestQuorumCall
Tests run: 1, Failures: 0, Errors: 0, Skipped: 0, Time elapsed: 0.24 sec - in org.apache.hadoop.hdfs.qjournal.client.TestQuorumCall
Java HotSpot(TM) 64-Bit Server VM warning: ignoring option MaxPermSize=768m; support was removed
in 8.0
Running org.apache.hadoop.hdfs.qjournal.client.TestQuorumJournalManager
Tests run: 21, Failures: 0, Errors: 0, Skipped: 0, Time elapsed: 19.849 sec - in org.apache.hadoop.hdfs.qjournal.client.TestQuorumJournalManager
Java HotSpot(TM) 64-Bit Server VM warning: ignoring option MaxPermSize=768m; support was removed
in 8.0
Running org.apache.hadoop.hdfs.qjournal.TestMiniJournalCluster
Tests run: 1, Failures: 0, Errors: 0, Skipped: 0, Time elapsed: 1.558 sec - in org.apache.hadoop.hdfs.qjournal.TestMiniJournalCluster
Java HotSpot(TM) 64-Bit Server VM warning: ignoring option MaxPermSize=768m; support was removed
in 8.0
Running org.apache.hadoop.hdfs.TestFileCreationEmpty
Tests run: 1, Failures: 0, Errors: 0, Skipped: 0, Time elapsed: 9.167 sec - in org.apache.hadoop.hdfs.TestFileCreationEmpty
Java HotSpot(TM) 64-Bit Server VM warning: ignoring option MaxPermSize=768m; support was removed
in 8.0
Running org.apache.hadoop.hdfs.TestBlockMissingException
Tests run: 1, Failures: 0, Errors: 0, Skipped: 0, Time elapsed: 4.606 sec - in org.apache.hadoop.hdfs.TestBlockMissingException
Java HotSpot(TM) 64-Bit Server VM warning: ignoring option MaxPermSize=768m; support was removed
in 8.0
Running org.apache.hadoop.hdfs.TestDataTransferKeepalive
Tests run: 4, Failures: 0, Errors: 0, Skipped: 0, Time elapsed: 16.125 sec - in org.apache.hadoop.hdfs.TestDataTransferKeepalive
Java HotSpot(TM) 64-Bit Server VM warning: ignoring option MaxPermSize=768m; support was removed
in 8.0
Running org.apache.hadoop.hdfs.TestModTime
Tests run: 2, Failures: 0, Errors: 0, Skipped: 0, Time elapsed: 12.899 sec - in org.apache.hadoop.hdfs.TestModTime
Java HotSpot(TM) 64-Bit Server VM warning: ignoring option MaxPermSize=768m; support was removed
in 8.0
Running org.apache.hadoop.hdfs.TestRollingUpgradeDowngrade
Tests run: 2, Failures: 0, Errors: 0, Skipped: 0, Time elapsed: 8.92 sec - in org.apache.hadoop.hdfs.TestRollingUpgradeDowngrade
Java HotSpot(TM) 64-Bit Server VM warning: ignoring option MaxPermSize=768m; support was removed
in 8.0
Running org.apache.hadoop.hdfs.TestLease
Tests run: 5, Failures: 0, Errors: 0, Skipped: 0, Time elapsed: 9.581 sec - in org.apache.hadoop.hdfs.TestLease
Java HotSpot(TM) 64-Bit Server VM warning: ignoring option MaxPermSize=768m; support was removed
in 8.0
Running org.apache.hadoop.hdfs.TestParallelUnixDomainRead
Tests run: 4, Failures: 0, Errors: 0, Skipped: 0, Time elapsed: 32.057 sec - in org.apache.hadoop.hdfs.TestParallelUnixDomainRead
Java HotSpot(TM) 64-Bit Server VM warning: ignoring option MaxPermSize=768m; support was removed
in 8.0
Running org.apache.hadoop.hdfs.TestDeprecatedKeys
Tests run: 1, Failures: 0, Errors: 0, Skipped: 0, Time elapsed: 0.432 sec - in org.apache.hadoop.hdfs.TestDeprecatedKeys
Java HotSpot(TM) 64-Bit Server VM warning: ignoring option MaxPermSize=768m; support was removed
in 8.0
Running org.apache.hadoop.hdfs.TestFSOutputSummer
Tests run: 2, Failures: 0, Errors: 0, Skipped: 0, Time elapsed: 8.453 sec - in org.apache.hadoop.hdfs.TestFSOutputSummer
Java HotSpot(TM) 64-Bit Server VM warning: ignoring option MaxPermSize=768m; support was removed
in 8.0
Running org.apache.hadoop.hdfs.TestRead
Tests run: 3, Failures: 0, Errors: 0, Skipped: 0, Time elapsed: 6.359 sec - in org.apache.hadoop.hdfs.TestRead
Java HotSpot(TM) 64-Bit Server VM warning: ignoring option MaxPermSize=768m; support was removed
in 8.0
Running org.apache.hadoop.hdfs.TestDFSInotifyEventInputStream
Tests run: 5, Failures: 0, Errors: 0, Skipped: 0, Time elapsed: 25.344 sec - in org.apache.hadoop.hdfs.TestDFSInotifyEventInputStream
Java HotSpot(TM) 64-Bit Server VM warning: ignoring option MaxPermSize=768m; support was removed
in 8.0
Running org.apache.hadoop.hdfs.TestCrcCorruption
Tests run: 4, Failures: 0, Errors: 0, Skipped: 0, Time elapsed: 15.75 sec - in org.apache.hadoop.hdfs.TestCrcCorruption
Java HotSpot(TM) 64-Bit Server VM warning: ignoring option MaxPermSize=768m; support was removed
in 8.0
Running org.apache.hadoop.hdfs.TestGetBlocks
Tests run: 3, Failures: 0, Errors: 0, Skipped: 0, Time elapsed: 40.989 sec - in org.apache.hadoop.hdfs.TestGetBlocks
Java HotSpot(TM) 64-Bit Server VM warning: ignoring option MaxPermSize=768m; support was removed
in 8.0
Running org.apache.hadoop.hdfs.TestDataTransferProtocol
Tests run: 3, Failures: 0, Errors: 0, Skipped: 0, Time elapsed: 5.71 sec - in org.apache.hadoop.hdfs.TestDataTransferProtocol
Java HotSpot(TM) 64-Bit Server VM warning: ignoring option MaxPermSize=768m; support was removed
in 8.0
Running org.apache.hadoop.hdfs.TestReadWhileWriting
Tests run: 1, Failures: 0, Errors: 0, Skipped: 0, Time elapsed: 6.644 sec - in org.apache.hadoop.hdfs.TestReadWhileWriting
Java HotSpot(TM) 64-Bit Server VM warning: ignoring option MaxPermSize=768m; support was removed
in 8.0
Running org.apache.hadoop.net.TestNetworkTopology
Tests run: 10, Failures: 0, Errors: 0, Skipped: 0, Time elapsed: 8.86 sec - in org.apache.hadoop.net.TestNetworkTopology
Java HotSpot(TM) 64-Bit Server VM warning: ignoring option MaxPermSize=768m; support was removed
in 8.0
Running org.apache.hadoop.tracing.TestTraceAdmin
Tests run: 1, Failures: 0, Errors: 0, Skipped: 0, Time elapsed: 3.894 sec - in org.apache.hadoop.tracing.TestTraceAdmin
Java HotSpot(TM) 64-Bit Server VM warning: ignoring option MaxPermSize=768m; support was removed
in 8.0
Running org.apache.hadoop.tracing.TestTracingShortCircuitLocalRead
Tests run: 1, Failures: 0, Errors: 0, Skipped: 0, Time elapsed: 4.22 sec - in org.apache.hadoop.tracing.TestTracingShortCircuitLocalRead
Java HotSpot(TM) 64-Bit Server VM warning: ignoring option MaxPermSize=768m; support was removed
in 8.0
Running org.apache.hadoop.tracing.TestTracing
Tests run: 5, Failures: 0, Errors: 0, Skipped: 0, Time elapsed: 4.827 sec - in org.apache.hadoop.tracing.TestTracing
Java HotSpot(TM) 64-Bit Server VM warning: ignoring option MaxPermSize=768m; support was removed
in 8.0
Running org.apache.hadoop.TestRefreshCallQueue
Tests run: 1, Failures: 0, Errors: 0, Skipped: 0, Time elapsed: 3.904 sec - in org.apache.hadoop.TestRefreshCallQueue

Results :

Tests in error: 
  TestDecommission.testIncludeByRegistrationName:957 ยป  test timed out after 360...

Tests run: 3203, Failures: 0, Errors: 1, Skipped: 17

[INFO]                                                                         
[INFO] ------------------------------------------------------------------------
[INFO] Skipping Apache Hadoop HttpFS
[INFO] This project has been banned from the build due to previous failures.
[INFO] ------------------------------------------------------------------------
[INFO]                                                                         
[INFO] ------------------------------------------------------------------------
[INFO] Skipping Apache Hadoop HDFS BookKeeper Journal
[INFO] This project has been banned from the build due to previous failures.
[INFO] ------------------------------------------------------------------------
[INFO]                                                                         
[INFO] ------------------------------------------------------------------------
[INFO] Skipping Apache Hadoop HDFS-NFS
[INFO] This project has been banned from the build due to previous failures.
[INFO] ------------------------------------------------------------------------
[INFO]                                                                         
[INFO] ------------------------------------------------------------------------
[INFO] Building Apache Hadoop HDFS Project 3.0.0-SNAPSHOT
[INFO] ------------------------------------------------------------------------
[WARNING] The POM for org.eclipse.m2e:lifecycle-mapping:jar:1.0.0 is missing, no dependency
information available
[WARNING] Failed to retrieve plugin descriptor for org.eclipse.m2e:lifecycle-mapping:1.0.0:
Plugin org.eclipse.m2e:lifecycle-mapping:1.0.0 or one of its dependencies could not be resolved:
Failure to find org.eclipse.m2e:lifecycle-mapping:jar:1.0.0 in http://repo.maven.apache.org/maven2
was cached in the local repository, resolution will not be reattempted until the update interval
of central has elapsed or updates are forced
[INFO] 
[INFO] --- maven-clean-plugin:2.4.1:clean (default-clean) @ hadoop-hdfs-project ---
[INFO] Deleting <https://builds.apache.org/job/Hadoop-Hdfs-trunk-Java8/ws/hadoop-hdfs-project/target>
[INFO] 
[INFO] --- maven-antrun-plugin:1.7:run (create-testdirs) @ hadoop-hdfs-project ---
[INFO] Executing tasks

main:
    [mkdir] Created dir: <https://builds.apache.org/job/Hadoop-Hdfs-trunk-Java8/ws/hadoop-hdfs-project/target/test-dir>
[INFO] Executed tasks
[INFO] 
[INFO] --- maven-source-plugin:2.1.2:jar-no-fork (hadoop-java-sources) @ hadoop-hdfs-project
---
[INFO] 
[INFO] --- maven-source-plugin:2.1.2:test-jar-no-fork (hadoop-java-sources) @ hadoop-hdfs-project
---
[INFO] 
[INFO] --- maven-enforcer-plugin:1.3.1:enforce (dist-enforce) @ hadoop-hdfs-project ---
[INFO] 
[INFO] --- maven-site-plugin:3.4:attach-descriptor (attach-descriptor) @ hadoop-hdfs-project
---
[INFO] 
[INFO] --- maven-javadoc-plugin:2.8.1:jar (module-javadocs) @ hadoop-hdfs-project ---
[INFO] Not executing Javadoc as the project is not a Java classpath-capable package
[INFO] 
[INFO] --- maven-enforcer-plugin:1.3.1:enforce (depcheck) @ hadoop-hdfs-project ---
[INFO] 
[INFO] --- maven-checkstyle-plugin:2.6:checkstyle (default-cli) @ hadoop-hdfs-project ---
[INFO] 
[INFO] --- findbugs-maven-plugin:3.0.0:findbugs (default-cli) @ hadoop-hdfs-project ---
[INFO] ------------------------------------------------------------------------
[INFO] Reactor Summary:
[INFO] 
[INFO] Apache Hadoop HDFS ................................ FAILURE [  03:01 h]
[INFO] Apache Hadoop HttpFS .............................. SKIPPED
[INFO] Apache Hadoop HDFS BookKeeper Journal ............. SKIPPED
[INFO] Apache Hadoop HDFS-NFS ............................ SKIPPED
[INFO] Apache Hadoop HDFS Project ........................ SUCCESS [  1.655 s]
[INFO] ------------------------------------------------------------------------
[INFO] BUILD FAILURE
[INFO] ------------------------------------------------------------------------
[INFO] Total time: 03:01 h
[INFO] Finished at: 2015-01-13T14:35:29+00:00
[INFO] Final Memory: 52M/251M
[INFO] ------------------------------------------------------------------------
[ERROR] Failed to execute goal org.apache.maven.plugins:maven-surefire-plugin:2.17:test (default-test)
on project hadoop-hdfs: There are test failures.
[ERROR] 
[ERROR] Please refer to <https://builds.apache.org/job/Hadoop-Hdfs-trunk-Java8/ws/hadoop-hdfs-project/hadoop-hdfs/target/surefire-reports>
for the individual test results.
[ERROR] -> [Help 1]
[ERROR] 
[ERROR] To see the full stack trace of the errors, re-run Maven with the -e switch.
[ERROR] Re-run Maven using the -X switch to enable full debug logging.
[ERROR] 
[ERROR] For more information about the errors and possible solutions, please read the following
articles:
[ERROR] [Help 1] http://cwiki.apache.org/confluence/display/MAVEN/MojoFailureException
Build step 'Execute shell' marked build as failure
Archiving artifacts
Recording test results
Updating HADOOP-11473
Updating HADOOP-11465
Updating YARN-2643
Updating HDFS-7056
Updating HDFS-7326
Updating HDFS-7598
Updating YARN-2957
Updating YARN-3027
Updating HDFS-5445
Updating HDFS-3107
Updating HDFS-7600
Updating HDFS-7533

Mime
View raw message