hadoop-hdfs-dev mailing list archives

Site index · List index
Message view « Date » · « Thread »
Top « Date » · « Thread »
From Apache Jenkins Server <jenk...@builds.apache.org>
Subject Build failed in Jenkins: Hadoop-Hdfs-trunk #2005
Date Wed, 14 Jan 2015 14:43:12 GMT
See <https://builds.apache.org/job/Hadoop-Hdfs-trunk/2005/changes>

Changes:

[xgong] MAPREDUCE-6173. Document the configuration of deploying MR over

[cnauroth] HDFS-7570. SecondaryNameNode need twice memory when calling reloadFromImageFile.
Contributed by zhaoyunjiong.

[jianhe] YARN-2637. Fixed max-am-resource-percent calculation in CapacityScheduler when activating
applications. Contributed by Craig Welch

[junping_du] YARN-3019. Make work-preserving-recovery the default mechanism for RM recovery.
(Contributed by Jian He)

[aajisaka] MAPREDUCE-6210. Use getApplicationAttemptId() instead of getApplicationID() for
logging AttemptId in RMContainerAllocator.java (Contributed by Leitao Guo)

------------------------------------------
[...truncated 10815 lines...]
[INFO] --- maven-compiler-plugin:2.5.1:testCompile (default-testCompile) @ hadoop-hdfs-bkjournal
---
[INFO] Compiling 9 source files to <https://builds.apache.org/job/Hadoop-Hdfs-trunk/ws/hadoop-hdfs-project/hadoop-hdfs/src/contrib/bkjournal/target/test-classes>
[INFO] 
[INFO] --- maven-surefire-plugin:2.17:test (default-test) @ hadoop-hdfs-bkjournal ---
[INFO] Surefire report directory: <https://builds.apache.org/job/Hadoop-Hdfs-trunk/ws/hadoop-hdfs-project/hadoop-hdfs/src/contrib/bkjournal/target/surefire-reports>

-------------------------------------------------------
 T E S T S
-------------------------------------------------------

-------------------------------------------------------
 T E S T S
-------------------------------------------------------
Running org.apache.hadoop.contrib.bkjournal.TestBookKeeperEditLogStreams
Tests run: 1, Failures: 0, Errors: 0, Skipped: 0, Time elapsed: 1.945 sec - in org.apache.hadoop.contrib.bkjournal.TestBookKeeperEditLogStreams
Running org.apache.hadoop.contrib.bkjournal.TestBookKeeperConfiguration
Tests run: 2, Failures: 0, Errors: 0, Skipped: 0, Time elapsed: 1.314 sec - in org.apache.hadoop.contrib.bkjournal.TestBookKeeperConfiguration
Running org.apache.hadoop.contrib.bkjournal.TestCurrentInprogress
Tests run: 3, Failures: 0, Errors: 0, Skipped: 0, Time elapsed: 0.636 sec - in org.apache.hadoop.contrib.bkjournal.TestCurrentInprogress
Running org.apache.hadoop.contrib.bkjournal.TestBookKeeperHACheckpoints
Tests run: 7, Failures: 0, Errors: 0, Skipped: 0, Time elapsed: 102.956 sec - in org.apache.hadoop.contrib.bkjournal.TestBookKeeperHACheckpoints
Running org.apache.hadoop.contrib.bkjournal.TestBookKeeperJournalManager
Tests run: 16, Failures: 0, Errors: 0, Skipped: 0, Time elapsed: 7.594 sec - in org.apache.hadoop.contrib.bkjournal.TestBookKeeperJournalManager
Running org.apache.hadoop.contrib.bkjournal.TestBootstrapStandbyWithBKJM
Tests run: 1, Failures: 0, Errors: 0, Skipped: 0, Time elapsed: 20.405 sec - in org.apache.hadoop.contrib.bkjournal.TestBootstrapStandbyWithBKJM
Running org.apache.hadoop.contrib.bkjournal.TestBookKeeperAsHASharedDir
Tests run: 5, Failures: 0, Errors: 0, Skipped: 0, Time elapsed: 13.441 sec - in org.apache.hadoop.contrib.bkjournal.TestBookKeeperAsHASharedDir

Results :

Tests run: 35, Failures: 0, Errors: 0, Skipped: 0

[INFO] 
[INFO] --- maven-jar-plugin:2.3.1:jar (default-jar) @ hadoop-hdfs-bkjournal ---
[INFO] Building jar: <https://builds.apache.org/job/Hadoop-Hdfs-trunk/ws/hadoop-hdfs-project/hadoop-hdfs/src/contrib/bkjournal/target/hadoop-hdfs-bkjournal-3.0.0-SNAPSHOT.jar>
[INFO] 
[INFO] --- maven-source-plugin:2.1.2:jar-no-fork (hadoop-java-sources) @ hadoop-hdfs-bkjournal
---
[INFO] org already added, skipping
[INFO] org/apache already added, skipping
[INFO] org/apache/hadoop already added, skipping
[INFO] org/apache/hadoop/contrib already added, skipping
[INFO] org/apache/hadoop/contrib/bkjournal already added, skipping
[INFO] Building jar: <https://builds.apache.org/job/Hadoop-Hdfs-trunk/ws/hadoop-hdfs-project/hadoop-hdfs/src/contrib/bkjournal/target/hadoop-hdfs-bkjournal-3.0.0-SNAPSHOT-sources.jar>
[INFO] org already added, skipping
[INFO] org/apache already added, skipping
[INFO] org/apache/hadoop already added, skipping
[INFO] org/apache/hadoop/contrib already added, skipping
[INFO] org/apache/hadoop/contrib/bkjournal already added, skipping
[INFO] 
[INFO] --- maven-source-plugin:2.1.2:test-jar-no-fork (hadoop-java-sources) @ hadoop-hdfs-bkjournal
---
[INFO] Building jar: <https://builds.apache.org/job/Hadoop-Hdfs-trunk/ws/hadoop-hdfs-project/hadoop-hdfs/src/contrib/bkjournal/target/hadoop-hdfs-bkjournal-3.0.0-SNAPSHOT-test-sources.jar>
[INFO] 
[INFO] --- maven-enforcer-plugin:1.3.1:enforce (dist-enforce) @ hadoop-hdfs-bkjournal ---
[INFO] 
[INFO] --- maven-site-plugin:3.4:attach-descriptor (attach-descriptor) @ hadoop-hdfs-bkjournal
---
[INFO] 
[INFO] --- maven-javadoc-plugin:2.8.1:jar (module-javadocs) @ hadoop-hdfs-bkjournal ---
[INFO] Skipping javadoc generation
[INFO] 
[INFO] --- maven-dependency-plugin:2.8:copy (dist) @ hadoop-hdfs-bkjournal ---
[INFO] Configured Artifact: org.apache.bookkeeper:bookkeeper-server:?:jar
[INFO] Copying bookkeeper-server-4.2.3.jar to <https://builds.apache.org/job/Hadoop-Hdfs-trunk/ws/hadoop-hdfs-project/hadoop-hdfs/src/contrib/bkjournal/target/lib/bookkeeper-server-4.2.3.jar>
[INFO] 
[INFO] --- maven-enforcer-plugin:1.3.1:enforce (depcheck) @ hadoop-hdfs-bkjournal ---
[INFO] 
[INFO] --- maven-checkstyle-plugin:2.6:checkstyle (default-cli) @ hadoop-hdfs-bkjournal ---
[INFO] 
[INFO] There are 333 checkstyle errors.
[WARNING] Unable to locate Source XRef to link to - DISABLED
[INFO] 
[INFO] --- findbugs-maven-plugin:3.0.0:findbugs (default-cli) @ hadoop-hdfs-bkjournal ---
[INFO] Fork Value is true
     [java] Warnings generated: 3
[INFO] Done FindBugs Analysis....
[INFO]                                                                         
[INFO] ------------------------------------------------------------------------
[INFO] Building Apache Hadoop HDFS-NFS 3.0.0-SNAPSHOT
[INFO] ------------------------------------------------------------------------
[WARNING] The POM for org.eclipse.m2e:lifecycle-mapping:jar:1.0.0 is missing, no dependency
information available
[WARNING] Failed to retrieve plugin descriptor for org.eclipse.m2e:lifecycle-mapping:1.0.0:
Plugin org.eclipse.m2e:lifecycle-mapping:1.0.0 or one of its dependencies could not be resolved:
Failure to find org.eclipse.m2e:lifecycle-mapping:jar:1.0.0 in http://repo.maven.apache.org/maven2
was cached in the local repository, resolution will not be reattempted until the update interval
of central has elapsed or updates are forced
[INFO] 
[INFO] --- maven-clean-plugin:2.4.1:clean (default-clean) @ hadoop-hdfs-nfs ---
[INFO] Deleting <https://builds.apache.org/job/Hadoop-Hdfs-trunk/ws/hadoop-hdfs-project/hadoop-hdfs-nfs/target>
[INFO] 
[INFO] --- maven-antrun-plugin:1.7:run (create-testdirs) @ hadoop-hdfs-nfs ---
[INFO] Executing tasks

main:
    [mkdir] Created dir: <https://builds.apache.org/job/Hadoop-Hdfs-trunk/ws/hadoop-hdfs-project/hadoop-hdfs-nfs/target/test-dir>
[INFO] Executed tasks
[INFO] 
[INFO] --- maven-resources-plugin:2.2:resources (default-resources) @ hadoop-hdfs-nfs ---
[INFO] Using default encoding to copy filtered resources.
[INFO] 
[INFO] --- maven-compiler-plugin:2.5.1:compile (default-compile) @ hadoop-hdfs-nfs ---
[INFO] Compiling 17 source files to <https://builds.apache.org/job/Hadoop-Hdfs-trunk/ws/hadoop-hdfs-project/hadoop-hdfs-nfs/target/classes>
[INFO] 
[INFO] --- maven-resources-plugin:2.2:testResources (default-testResources) @ hadoop-hdfs-nfs
---
[INFO] Using default encoding to copy filtered resources.
[INFO] 
[INFO] --- maven-compiler-plugin:2.5.1:testCompile (default-testCompile) @ hadoop-hdfs-nfs
---
[INFO] Compiling 13 source files to <https://builds.apache.org/job/Hadoop-Hdfs-trunk/ws/hadoop-hdfs-project/hadoop-hdfs-nfs/target/test-classes>
[INFO] 
[INFO] --- maven-surefire-plugin:2.17:test (default-test) @ hadoop-hdfs-nfs ---
[INFO] Surefire report directory: <https://builds.apache.org/job/Hadoop-Hdfs-trunk/ws/hadoop-hdfs-project/hadoop-hdfs-nfs/target/surefire-reports>

-------------------------------------------------------
 T E S T S
-------------------------------------------------------

-------------------------------------------------------
 T E S T S
-------------------------------------------------------
Running org.apache.hadoop.hdfs.nfs.nfs3.TestReaddir
Tests run: 2, Failures: 0, Errors: 0, Skipped: 0, Time elapsed: 4.629 sec - in org.apache.hadoop.hdfs.nfs.nfs3.TestReaddir
Running org.apache.hadoop.hdfs.nfs.nfs3.TestExportsTable
Tests run: 1, Failures: 0, Errors: 0, Skipped: 0, Time elapsed: 4.188 sec - in org.apache.hadoop.hdfs.nfs.nfs3.TestExportsTable
Running org.apache.hadoop.hdfs.nfs.nfs3.TestWrites
Tests run: 9, Failures: 0, Errors: 0, Skipped: 0, Time elapsed: 14.962 sec - in org.apache.hadoop.hdfs.nfs.nfs3.TestWrites
Running org.apache.hadoop.hdfs.nfs.nfs3.TestClientAccessPrivilege
Tests run: 1, Failures: 0, Errors: 0, Skipped: 0, Time elapsed: 4.5 sec - in org.apache.hadoop.hdfs.nfs.nfs3.TestClientAccessPrivilege
Running org.apache.hadoop.hdfs.nfs.nfs3.TestNfs3Utils
Tests run: 1, Failures: 0, Errors: 0, Skipped: 0, Time elapsed: 0.295 sec - in org.apache.hadoop.hdfs.nfs.nfs3.TestNfs3Utils
Running org.apache.hadoop.hdfs.nfs.nfs3.TestRpcProgramNfs3
Tests run: 22, Failures: 0, Errors: 0, Skipped: 0, Time elapsed: 6.62 sec - in org.apache.hadoop.hdfs.nfs.nfs3.TestRpcProgramNfs3
Running org.apache.hadoop.hdfs.nfs.nfs3.TestDFSClientCache
Tests run: 3, Failures: 0, Errors: 0, Skipped: 0, Time elapsed: 1.541 sec - in org.apache.hadoop.hdfs.nfs.nfs3.TestDFSClientCache
Running org.apache.hadoop.hdfs.nfs.nfs3.TestOffsetRange
Tests run: 5, Failures: 0, Errors: 0, Skipped: 0, Time elapsed: 0.087 sec - in org.apache.hadoop.hdfs.nfs.nfs3.TestOffsetRange
Running org.apache.hadoop.hdfs.nfs.nfs3.TestOpenFileCtxCache
Tests run: 2, Failures: 0, Errors: 0, Skipped: 0, Time elapsed: 32.24 sec - in org.apache.hadoop.hdfs.nfs.nfs3.TestOpenFileCtxCache
Running org.apache.hadoop.hdfs.nfs.nfs3.TestNfs3HttpServer
Tests run: 1, Failures: 0, Errors: 0, Skipped: 0, Time elapsed: 5.2 sec - in org.apache.hadoop.hdfs.nfs.nfs3.TestNfs3HttpServer
Running org.apache.hadoop.hdfs.nfs.TestMountd
Tests run: 1, Failures: 0, Errors: 0, Skipped: 0, Time elapsed: 4.083 sec - in org.apache.hadoop.hdfs.nfs.TestMountd

Results :

Tests run: 48, Failures: 0, Errors: 0, Skipped: 0

[INFO] 
[INFO] --- maven-jar-plugin:2.3.1:jar (default-jar) @ hadoop-hdfs-nfs ---
[INFO] Building jar: <https://builds.apache.org/job/Hadoop-Hdfs-trunk/ws/hadoop-hdfs-project/hadoop-hdfs-nfs/target/hadoop-hdfs-nfs-3.0.0-SNAPSHOT.jar>
[INFO] 
[INFO] --- maven-source-plugin:2.1.2:jar-no-fork (hadoop-java-sources) @ hadoop-hdfs-nfs ---
[INFO] Building jar: <https://builds.apache.org/job/Hadoop-Hdfs-trunk/ws/hadoop-hdfs-project/hadoop-hdfs-nfs/target/hadoop-hdfs-nfs-3.0.0-SNAPSHOT-sources.jar>
[INFO] 
[INFO] --- maven-source-plugin:2.1.2:test-jar-no-fork (hadoop-java-sources) @ hadoop-hdfs-nfs
---
[INFO] Building jar: <https://builds.apache.org/job/Hadoop-Hdfs-trunk/ws/hadoop-hdfs-project/hadoop-hdfs-nfs/target/hadoop-hdfs-nfs-3.0.0-SNAPSHOT-test-sources.jar>
[INFO] 
[INFO] --- maven-enforcer-plugin:1.3.1:enforce (dist-enforce) @ hadoop-hdfs-nfs ---
[INFO] 
[INFO] --- maven-site-plugin:3.4:attach-descriptor (attach-descriptor) @ hadoop-hdfs-nfs ---
[INFO] 
[INFO] --- maven-javadoc-plugin:2.8.1:jar (module-javadocs) @ hadoop-hdfs-nfs ---
[INFO] Skipping javadoc generation
[INFO] 
[INFO] --- maven-assembly-plugin:2.3:single (dist) @ hadoop-hdfs-nfs ---
[INFO] Reading assembly descriptor: ../../hadoop-assemblies/src/main/resources/assemblies/hadoop-hdfs-nfs-dist.xml
[WARNING] The following patterns were never triggered in this artifact exclusion filter:
o  'org.apache.hadoop:hadoop-common'
o  'org.slf4j:slf4j-api'
o  'org.slf4j:slf4j-log4j12'
o  'org.hsqldb:hsqldb'

[INFO] Copying files to <https://builds.apache.org/job/Hadoop-Hdfs-trunk/ws/hadoop-hdfs-project/hadoop-hdfs-nfs/target/hadoop-hdfs-nfs-3.0.0-SNAPSHOT>
[INFO] 
[INFO] --- maven-enforcer-plugin:1.3.1:enforce (depcheck) @ hadoop-hdfs-nfs ---
[INFO] 
[INFO] --- maven-checkstyle-plugin:2.6:checkstyle (default-cli) @ hadoop-hdfs-nfs ---
[INFO] 
[INFO] There are 1347 checkstyle errors.
[WARNING] Unable to locate Source XRef to link to - DISABLED
[INFO] 
[INFO] --- findbugs-maven-plugin:3.0.0:findbugs (default-cli) @ hadoop-hdfs-nfs ---
[INFO] Fork Value is true
[INFO] Done FindBugs Analysis....
[INFO]                                                                         
[INFO] ------------------------------------------------------------------------
[INFO] Building Apache Hadoop HDFS Project 3.0.0-SNAPSHOT
[INFO] ------------------------------------------------------------------------
[WARNING] The POM for org.eclipse.m2e:lifecycle-mapping:jar:1.0.0 is missing, no dependency
information available
[WARNING] Failed to retrieve plugin descriptor for org.eclipse.m2e:lifecycle-mapping:1.0.0:
Plugin org.eclipse.m2e:lifecycle-mapping:1.0.0 or one of its dependencies could not be resolved:
Failure to find org.eclipse.m2e:lifecycle-mapping:jar:1.0.0 in http://repo.maven.apache.org/maven2
was cached in the local repository, resolution will not be reattempted until the update interval
of central has elapsed or updates are forced
[INFO] 
[INFO] --- maven-clean-plugin:2.4.1:clean (default-clean) @ hadoop-hdfs-project ---
[INFO] Deleting <https://builds.apache.org/job/Hadoop-Hdfs-trunk/ws/hadoop-hdfs-project/target>
[INFO] 
[INFO] --- maven-antrun-plugin:1.7:run (create-testdirs) @ hadoop-hdfs-project ---
[INFO] Executing tasks

main:
    [mkdir] Created dir: <https://builds.apache.org/job/Hadoop-Hdfs-trunk/ws/hadoop-hdfs-project/target/test-dir>
[INFO] Executed tasks
[INFO] 
[INFO] --- maven-source-plugin:2.1.2:jar-no-fork (hadoop-java-sources) @ hadoop-hdfs-project
---
[INFO] 
[INFO] --- maven-source-plugin:2.1.2:test-jar-no-fork (hadoop-java-sources) @ hadoop-hdfs-project
---
[INFO] 
[INFO] --- maven-enforcer-plugin:1.3.1:enforce (dist-enforce) @ hadoop-hdfs-project ---
[INFO] 
[INFO] --- maven-site-plugin:3.4:attach-descriptor (attach-descriptor) @ hadoop-hdfs-project
---
[INFO] 
[INFO] --- maven-javadoc-plugin:2.8.1:jar (module-javadocs) @ hadoop-hdfs-project ---
[INFO] Skipping javadoc generation
[INFO] 
[INFO] --- maven-enforcer-plugin:1.3.1:enforce (depcheck) @ hadoop-hdfs-project ---
[INFO] 
[INFO] --- maven-checkstyle-plugin:2.6:checkstyle (default-cli) @ hadoop-hdfs-project ---
[INFO] 
[INFO] --- findbugs-maven-plugin:3.0.0:findbugs (default-cli) @ hadoop-hdfs-project ---
[INFO] ------------------------------------------------------------------------
[INFO] Reactor Summary:
[INFO] 
[INFO] Apache Hadoop HDFS ................................ SUCCESS [  02:51 h]
[INFO] Apache Hadoop HttpFS .............................. FAILURE [12:26 min]
[INFO] Apache Hadoop HDFS BookKeeper Journal ............. SUCCESS [02:47 min]
[INFO] Apache Hadoop HDFS-NFS ............................ SUCCESS [01:40 min]
[INFO] Apache Hadoop HDFS Project ........................ SUCCESS [  0.046 s]
[INFO] ------------------------------------------------------------------------
[INFO] BUILD FAILURE
[INFO] ------------------------------------------------------------------------
[INFO] Total time: 03:08 h
[INFO] Finished at: 2015-01-14T14:42:40+00:00
[INFO] Final Memory: 81M/1450M
[INFO] ------------------------------------------------------------------------
[ERROR] Failed to execute goal org.apache.maven.plugins:maven-surefire-plugin:2.17:test (default-test)
on project hadoop-hdfs-httpfs: There was a timeout or other error in the fork -> [Help
1]
[ERROR] 
[ERROR] To see the full stack trace of the errors, re-run Maven with the -e switch.
[ERROR] Re-run Maven using the -X switch to enable full debug logging.
[ERROR] 
[ERROR] For more information about the errors and possible solutions, please read the following
articles:
[ERROR] [Help 1] http://cwiki.apache.org/confluence/display/MAVEN/MojoFailureException
[ERROR] 
[ERROR] After correcting the problems, you can resume the build with the command
[ERROR]   mvn <goals> -rf :hadoop-hdfs-httpfs
Build step 'Execute shell' marked build as failure
Archiving artifacts
Sending artifact delta relative to Hadoop-Hdfs-trunk #2004
Archived 1 artifacts
Archive block size is 32768
Received 1 blocks and 24636138 bytes
Compression is 0.1%
Took 7.1 sec
Recording test results
Updating MAPREDUCE-6173
Updating MAPREDUCE-6210
Updating HDFS-7570
Updating YARN-3019
Updating YARN-2637

Mime
View raw message