hadoop-hdfs-dev mailing list archives

Site index · List index
Message view « Date » · « Thread »
Top « Date » · « Thread »
From Apache Jenkins Server <jenk...@builds.apache.org>
Subject Build failed in Jenkins: Hadoop-Hdfs-trunk-Java8 #85
Date Thu, 29 Jan 2015 14:17:45 GMT
See <https://builds.apache.org/job/Hadoop-Hdfs-trunk-Java8/85/changes>

Changes:

[ozawa] HADOOP-11317. Increment SLF4J version to 1.7.10. Contributed by Tim Robertson.

[ozawa] HADOOP-11316. "mvn package -Pdist,docs -DskipTests -Dtar" fails because of non-ascii
characters. (ozawa)

[wang] HDFS-6673. Add delimited format support to PB OIV tool. Contributed by Eddy Xu.

[jianhe] YARN-3103. AMRMClientImpl does not update AMRM token properly. Contributed by Jason
Lowe

[jing9] HDFS-7611. deleteSnapshot and delete of a file can leave orphaned blocks in the blocksMap
on NameNode restart. Contributed by Jing Zhao and Byron Wong.

[jianhe] MAPREDUCE-6230. Fixed RMContainerAllocator to update the new AMRMToken service name
properly. Contributed by Jason Lowe

[szetszwo] HDFS-7681. Change ReplicaInputStreams constructor to take InputStream(s) instead
of FileDescriptor(s).  Contributed by Joe Pallas

[yliu] HDFS-7423. various typos and message formatting fixes in nfs daemon and doc. (Charles
Lamb via yliu)

[wangda] YARN-3079. Scheduler should also update maximumAllocation when updateNodeResource.
(Zhihai Xu via wangda)

[aajisaka] HADOOP-10525. Remove DRFA.MaxBackupIndex config from log4j.properties (aajisaka)

------------------------------------------
[...truncated 6684 lines...]
Running org.apache.hadoop.fs.loadGenerator.TestLoadGenerator
Tests run: 2, Failures: 0, Errors: 0, Skipped: 0, Time elapsed: 14.513 sec - in org.apache.hadoop.fs.loadGenerator.TestLoadGenerator
Java HotSpot(TM) 64-Bit Server VM warning: ignoring option MaxPermSize=768m; support was removed
in 8.0
Running org.apache.hadoop.fs.TestSymlinkHdfsDisable
Tests run: 1, Failures: 0, Errors: 0, Skipped: 0, Time elapsed: 3.941 sec - in org.apache.hadoop.fs.TestSymlinkHdfsDisable
Java HotSpot(TM) 64-Bit Server VM warning: ignoring option MaxPermSize=768m; support was removed
in 8.0
Running org.apache.hadoop.fs.TestSymlinkHdfsFileSystem
Tests run: 72, Failures: 0, Errors: 0, Skipped: 2, Time elapsed: 7.871 sec - in org.apache.hadoop.fs.TestSymlinkHdfsFileSystem
Java HotSpot(TM) 64-Bit Server VM warning: ignoring option MaxPermSize=768m; support was removed
in 8.0
Running org.apache.hadoop.fs.TestUrlStreamHandler
Tests run: 2, Failures: 0, Errors: 0, Skipped: 0, Time elapsed: 4.221 sec - in org.apache.hadoop.fs.TestUrlStreamHandler
Java HotSpot(TM) 64-Bit Server VM warning: ignoring option MaxPermSize=768m; support was removed
in 8.0
Running org.apache.hadoop.fs.TestXAttr
Tests run: 2, Failures: 0, Errors: 0, Skipped: 0, Time elapsed: 0.087 sec - in org.apache.hadoop.fs.TestXAttr
Java HotSpot(TM) 64-Bit Server VM warning: ignoring option MaxPermSize=768m; support was removed
in 8.0
Running org.apache.hadoop.fs.TestFcHdfsCreateMkdir
Tests run: 8, Failures: 0, Errors: 0, Skipped: 0, Time elapsed: 4.153 sec - in org.apache.hadoop.fs.TestFcHdfsCreateMkdir
Java HotSpot(TM) 64-Bit Server VM warning: ignoring option MaxPermSize=768m; support was removed
in 8.0
Running org.apache.hadoop.fs.TestEnhancedByteBufferAccess
Tests run: 10, Failures: 0, Errors: 0, Skipped: 1, Time elapsed: 16.271 sec - in org.apache.hadoop.fs.TestEnhancedByteBufferAccess
Java HotSpot(TM) 64-Bit Server VM warning: ignoring option MaxPermSize=768m; support was removed
in 8.0
Running org.apache.hadoop.fs.TestHdfsNativeCodeLoader
Tests run: 1, Failures: 0, Errors: 0, Skipped: 0, Time elapsed: 0.152 sec - in org.apache.hadoop.fs.TestHdfsNativeCodeLoader
Java HotSpot(TM) 64-Bit Server VM warning: ignoring option MaxPermSize=768m; support was removed
in 8.0
Running org.apache.hadoop.fs.TestUrlStreamHandlerFactory
Tests run: 1, Failures: 0, Errors: 0, Skipped: 0, Time elapsed: 1.11 sec - in org.apache.hadoop.fs.TestUrlStreamHandlerFactory
Java HotSpot(TM) 64-Bit Server VM warning: ignoring option MaxPermSize=768m; support was removed
in 8.0
Running org.apache.hadoop.fs.TestHDFSFileContextMainOperations
Tests run: 67, Failures: 0, Errors: 0, Skipped: 0, Time elapsed: 7.869 sec - in org.apache.hadoop.fs.TestHDFSFileContextMainOperations
Java HotSpot(TM) 64-Bit Server VM warning: ignoring option MaxPermSize=768m; support was removed
in 8.0
Running org.apache.hadoop.fs.shell.TestHdfsTextCommand
Tests run: 1, Failures: 0, Errors: 0, Skipped: 0, Time elapsed: 4.232 sec - in org.apache.hadoop.fs.shell.TestHdfsTextCommand
Java HotSpot(TM) 64-Bit Server VM warning: ignoring option MaxPermSize=768m; support was removed
in 8.0
Running org.apache.hadoop.fs.TestResolveHdfsSymlink
Tests run: 4, Failures: 0, Errors: 0, Skipped: 0, Time elapsed: 3.569 sec - in org.apache.hadoop.fs.TestResolveHdfsSymlink
Java HotSpot(TM) 64-Bit Server VM warning: ignoring option MaxPermSize=768m; support was removed
in 8.0
Running org.apache.hadoop.fs.TestVolumeId
Tests run: 3, Failures: 0, Errors: 0, Skipped: 0, Time elapsed: 0.167 sec - in org.apache.hadoop.fs.TestVolumeId
Java HotSpot(TM) 64-Bit Server VM warning: ignoring option MaxPermSize=768m; support was removed
in 8.0
Running org.apache.hadoop.fs.viewfs.TestViewFsWithAcls
Tests run: 1, Failures: 0, Errors: 0, Skipped: 0, Time elapsed: 4.294 sec - in org.apache.hadoop.fs.viewfs.TestViewFsWithAcls
Java HotSpot(TM) 64-Bit Server VM warning: ignoring option MaxPermSize=768m; support was removed
in 8.0
Running org.apache.hadoop.fs.viewfs.TestViewFsFileStatusHdfs
Tests run: 2, Failures: 0, Errors: 0, Skipped: 0, Time elapsed: 3.544 sec - in org.apache.hadoop.fs.viewfs.TestViewFsFileStatusHdfs
Java HotSpot(TM) 64-Bit Server VM warning: ignoring option MaxPermSize=768m; support was removed
in 8.0
Running org.apache.hadoop.fs.viewfs.TestViewFileSystemHdfs
Tests run: 52, Failures: 0, Errors: 0, Skipped: 0, Time elapsed: 8.425 sec - in org.apache.hadoop.fs.viewfs.TestViewFileSystemHdfs
Java HotSpot(TM) 64-Bit Server VM warning: ignoring option MaxPermSize=768m; support was removed
in 8.0
Running org.apache.hadoop.fs.viewfs.TestViewFsWithXAttrs
Tests run: 1, Failures: 0, Errors: 0, Skipped: 0, Time elapsed: 4.413 sec - in org.apache.hadoop.fs.viewfs.TestViewFsWithXAttrs
Java HotSpot(TM) 64-Bit Server VM warning: ignoring option MaxPermSize=768m; support was removed
in 8.0
Running org.apache.hadoop.fs.viewfs.TestViewFsAtHdfsRoot
Tests run: 54, Failures: 0, Errors: 0, Skipped: 0, Time elapsed: 7.681 sec - in org.apache.hadoop.fs.viewfs.TestViewFsAtHdfsRoot
Java HotSpot(TM) 64-Bit Server VM warning: ignoring option MaxPermSize=768m; support was removed
in 8.0
Running org.apache.hadoop.fs.viewfs.TestViewFsHdfs
Tests run: 54, Failures: 0, Errors: 0, Skipped: 0, Time elapsed: 6.955 sec - in org.apache.hadoop.fs.viewfs.TestViewFsHdfs
Java HotSpot(TM) 64-Bit Server VM warning: ignoring option MaxPermSize=768m; support was removed
in 8.0
Running org.apache.hadoop.fs.viewfs.TestViewFileSystemWithAcls
Tests run: 1, Failures: 0, Errors: 0, Skipped: 0, Time elapsed: 4.432 sec - in org.apache.hadoop.fs.viewfs.TestViewFileSystemWithAcls
Java HotSpot(TM) 64-Bit Server VM warning: ignoring option MaxPermSize=768m; support was removed
in 8.0
Running org.apache.hadoop.fs.viewfs.TestViewFileSystemAtHdfsRoot
Tests run: 52, Failures: 0, Errors: 0, Skipped: 0, Time elapsed: 8.092 sec - in org.apache.hadoop.fs.viewfs.TestViewFileSystemAtHdfsRoot
Java HotSpot(TM) 64-Bit Server VM warning: ignoring option MaxPermSize=768m; support was removed
in 8.0
Running org.apache.hadoop.fs.viewfs.TestViewFileSystemWithXAttrs
Tests run: 1, Failures: 0, Errors: 0, Skipped: 0, Time elapsed: 4.427 sec - in org.apache.hadoop.fs.viewfs.TestViewFileSystemWithXAttrs
Java HotSpot(TM) 64-Bit Server VM warning: ignoring option MaxPermSize=768m; support was removed
in 8.0
Running org.apache.hadoop.fs.viewfs.TestViewFsDefaultValue
Tests run: 4, Failures: 0, Errors: 0, Skipped: 0, Time elapsed: 3.511 sec - in org.apache.hadoop.fs.viewfs.TestViewFsDefaultValue
Java HotSpot(TM) 64-Bit Server VM warning: ignoring option MaxPermSize=768m; support was removed
in 8.0
Running org.apache.hadoop.fs.TestSymlinkHdfsFileContext
Tests run: 69, Failures: 0, Errors: 0, Skipped: 0, Time elapsed: 7.225 sec - in org.apache.hadoop.fs.TestSymlinkHdfsFileContext
Java HotSpot(TM) 64-Bit Server VM warning: ignoring option MaxPermSize=768m; support was removed
in 8.0
Running org.apache.hadoop.fs.contract.hdfs.TestHDFSContractDelete
Tests run: 8, Failures: 0, Errors: 0, Skipped: 0, Time elapsed: 4.508 sec - in org.apache.hadoop.fs.contract.hdfs.TestHDFSContractDelete
Java HotSpot(TM) 64-Bit Server VM warning: ignoring option MaxPermSize=768m; support was removed
in 8.0
Running org.apache.hadoop.fs.contract.hdfs.TestHDFSContractMkdir
Tests run: 5, Failures: 0, Errors: 0, Skipped: 0, Time elapsed: 4.356 sec - in org.apache.hadoop.fs.contract.hdfs.TestHDFSContractMkdir
Java HotSpot(TM) 64-Bit Server VM warning: ignoring option MaxPermSize=768m; support was removed
in 8.0
Running org.apache.hadoop.fs.contract.hdfs.TestHDFSContractOpen
Tests run: 6, Failures: 0, Errors: 0, Skipped: 0, Time elapsed: 4.281 sec - in org.apache.hadoop.fs.contract.hdfs.TestHDFSContractOpen
Java HotSpot(TM) 64-Bit Server VM warning: ignoring option MaxPermSize=768m; support was removed
in 8.0
Running org.apache.hadoop.fs.contract.hdfs.TestHDFSContractRootDirectory
Tests run: 5, Failures: 0, Errors: 0, Skipped: 0, Time elapsed: 3.769 sec - in org.apache.hadoop.fs.contract.hdfs.TestHDFSContractRootDirectory
Java HotSpot(TM) 64-Bit Server VM warning: ignoring option MaxPermSize=768m; support was removed
in 8.0
Running org.apache.hadoop.fs.contract.hdfs.TestHDFSContractAppend
Tests run: 5, Failures: 0, Errors: 0, Skipped: 1, Time elapsed: 4.627 sec - in org.apache.hadoop.fs.contract.hdfs.TestHDFSContractAppend
Java HotSpot(TM) 64-Bit Server VM warning: ignoring option MaxPermSize=768m; support was removed
in 8.0
Running org.apache.hadoop.fs.contract.hdfs.TestHDFSContractCreate
Tests run: 6, Failures: 0, Errors: 0, Skipped: 0, Time elapsed: 4.475 sec - in org.apache.hadoop.fs.contract.hdfs.TestHDFSContractCreate
Java HotSpot(TM) 64-Bit Server VM warning: ignoring option MaxPermSize=768m; support was removed
in 8.0
Running org.apache.hadoop.fs.contract.hdfs.TestHDFSContractSeek
Tests run: 10, Failures: 0, Errors: 0, Skipped: 0, Time elapsed: 6.194 sec - in org.apache.hadoop.fs.contract.hdfs.TestHDFSContractSeek
Java HotSpot(TM) 64-Bit Server VM warning: ignoring option MaxPermSize=768m; support was removed
in 8.0
Running org.apache.hadoop.fs.contract.hdfs.TestHDFSContractRename
Tests run: 6, Failures: 0, Errors: 0, Skipped: 0, Time elapsed: 4.621 sec - in org.apache.hadoop.fs.contract.hdfs.TestHDFSContractRename
Java HotSpot(TM) 64-Bit Server VM warning: ignoring option MaxPermSize=768m; support was removed
in 8.0
Running org.apache.hadoop.fs.contract.hdfs.TestHDFSContractConcat
Tests run: 4, Failures: 0, Errors: 0, Skipped: 0, Time elapsed: 4.437 sec - in org.apache.hadoop.fs.contract.hdfs.TestHDFSContractConcat
Java HotSpot(TM) 64-Bit Server VM warning: ignoring option MaxPermSize=768m; support was removed
in 8.0
Running org.apache.hadoop.fs.permission.TestStickyBit
Tests run: 6, Failures: 0, Errors: 0, Skipped: 0, Time elapsed: 8.648 sec - in org.apache.hadoop.fs.permission.TestStickyBit
Java HotSpot(TM) 64-Bit Server VM warning: ignoring option MaxPermSize=768m; support was removed
in 8.0
Running org.apache.hadoop.TestRefreshCallQueue
Tests run: 1, Failures: 0, Errors: 0, Skipped: 0, Time elapsed: 3.802 sec - in org.apache.hadoop.TestRefreshCallQueue
Java HotSpot(TM) 64-Bit Server VM warning: ignoring option MaxPermSize=768m; support was removed
in 8.0
Running org.apache.hadoop.security.TestPermissionSymlinks
Tests run: 15, Failures: 0, Errors: 0, Skipped: 0, Time elapsed: 5.164 sec - in org.apache.hadoop.security.TestPermissionSymlinks
Java HotSpot(TM) 64-Bit Server VM warning: ignoring option MaxPermSize=768m; support was removed
in 8.0
Running org.apache.hadoop.security.TestRefreshUserMappings
Tests run: 2, Failures: 0, Errors: 0, Skipped: 0, Time elapsed: 5.586 sec - in org.apache.hadoop.security.TestRefreshUserMappings
Java HotSpot(TM) 64-Bit Server VM warning: ignoring option MaxPermSize=768m; support was removed
in 8.0
Running org.apache.hadoop.security.TestPermission
Tests run: 3, Failures: 0, Errors: 0, Skipped: 0, Time elapsed: 6.119 sec - in org.apache.hadoop.security.TestPermission
Java HotSpot(TM) 64-Bit Server VM warning: ignoring option MaxPermSize=768m; support was removed
in 8.0
Running org.apache.hadoop.tools.TestTools
Tests run: 5, Failures: 0, Errors: 0, Skipped: 0, Time elapsed: 1.021 sec - in org.apache.hadoop.tools.TestTools
Java HotSpot(TM) 64-Bit Server VM warning: ignoring option MaxPermSize=768m; support was removed
in 8.0
Running org.apache.hadoop.tools.TestJMXGet
Tests run: 2, Failures: 0, Errors: 0, Skipped: 0, Time elapsed: 5.263 sec - in org.apache.hadoop.tools.TestJMXGet
Java HotSpot(TM) 64-Bit Server VM warning: ignoring option MaxPermSize=768m; support was removed
in 8.0
Running org.apache.hadoop.tracing.TestTracing
Tests run: 5, Failures: 0, Errors: 0, Skipped: 0, Time elapsed: 4.547 sec - in org.apache.hadoop.tracing.TestTracing
Java HotSpot(TM) 64-Bit Server VM warning: ignoring option MaxPermSize=768m; support was removed
in 8.0
Running org.apache.hadoop.tracing.TestTraceAdmin
Tests run: 1, Failures: 0, Errors: 0, Skipped: 0, Time elapsed: 3.779 sec - in org.apache.hadoop.tracing.TestTraceAdmin
Java HotSpot(TM) 64-Bit Server VM warning: ignoring option MaxPermSize=768m; support was removed
in 8.0
Running org.apache.hadoop.tracing.TestTracingShortCircuitLocalRead
Tests run: 1, Failures: 0, Errors: 0, Skipped: 0, Time elapsed: 4.065 sec - in org.apache.hadoop.tracing.TestTracingShortCircuitLocalRead
Java HotSpot(TM) 64-Bit Server VM warning: ignoring option MaxPermSize=768m; support was removed
in 8.0
Running org.apache.hadoop.net.TestNetworkTopology
Tests run: 10, Failures: 0, Errors: 0, Skipped: 0, Time elapsed: 8.871 sec - in org.apache.hadoop.net.TestNetworkTopology
Java HotSpot(TM) 64-Bit Server VM warning: ignoring option MaxPermSize=768m; support was removed
in 8.0
Running org.apache.hadoop.TestGenericRefresh
Tests run: 9, Failures: 0, Errors: 0, Skipped: 0, Time elapsed: 3.485 sec - in org.apache.hadoop.TestGenericRefresh
Java HotSpot(TM) 64-Bit Server VM warning: ignoring option MaxPermSize=768m; support was removed
in 8.0
Running org.apache.hadoop.cli.TestHDFSCLI
Tests run: 1, Failures: 0, Errors: 0, Skipped: 0, Time elapsed: 61.749 sec - in org.apache.hadoop.cli.TestHDFSCLI
Java HotSpot(TM) 64-Bit Server VM warning: ignoring option MaxPermSize=768m; support was removed
in 8.0
Running org.apache.hadoop.cli.TestCacheAdminCLI
Tests run: 1, Failures: 0, Errors: 0, Skipped: 0, Time elapsed: 6.2 sec - in org.apache.hadoop.cli.TestCacheAdminCLI
Java HotSpot(TM) 64-Bit Server VM warning: ignoring option MaxPermSize=768m; support was removed
in 8.0
Running org.apache.hadoop.cli.TestAclCLI
Tests run: 1, Failures: 0, Errors: 0, Skipped: 0, Time elapsed: 6.002 sec - in org.apache.hadoop.cli.TestAclCLI
Java HotSpot(TM) 64-Bit Server VM warning: ignoring option MaxPermSize=768m; support was removed
in 8.0
Running org.apache.hadoop.cli.TestCryptoAdminCLI
Tests run: 1, Failures: 0, Errors: 0, Skipped: 0, Time elapsed: 6.688 sec - in org.apache.hadoop.cli.TestCryptoAdminCLI
Java HotSpot(TM) 64-Bit Server VM warning: ignoring option MaxPermSize=768m; support was removed
in 8.0
Running org.apache.hadoop.cli.TestXAttrCLI
Tests run: 1, Failures: 0, Errors: 0, Skipped: 0, Time elapsed: 7.13 sec - in org.apache.hadoop.cli.TestXAttrCLI

Results :

Failed tests: 
  TestLeaseRecovery2.tearDown:105 Test resulted in an unexpected exit

Tests in error: 
  TestLeaseRecovery2.testHardLeaseRecoveryAfterNameNodeRestart2:427->hardLeaseRecoveryRestartHelper:494
» Exit
  TestLeaseRecovery2.testHardLeaseRecoveryWithRenameAfterNameNodeRestart:433->hardLeaseRecoveryRestartHelper:446
» EOF
  TestLeaseRecovery2.testLeaseRecoverByAnotherUser:159 » IllegalState Lease moni...
  TestLeaseRecovery2.testHardLeaseRecovery:276 » Connect Call From asf904.gq1.yg...

Tests run: 3239, Failures: 1, Errors: 4, Skipped: 17

[INFO]                                                                         
[INFO] ------------------------------------------------------------------------
[INFO] Skipping Apache Hadoop HttpFS
[INFO] This project has been banned from the build due to previous failures.
[INFO] ------------------------------------------------------------------------
[INFO]                                                                         
[INFO] ------------------------------------------------------------------------
[INFO] Skipping Apache Hadoop HDFS BookKeeper Journal
[INFO] This project has been banned from the build due to previous failures.
[INFO] ------------------------------------------------------------------------
[INFO]                                                                         
[INFO] ------------------------------------------------------------------------
[INFO] Skipping Apache Hadoop HDFS-NFS
[INFO] This project has been banned from the build due to previous failures.
[INFO] ------------------------------------------------------------------------
[INFO]                                                                         
[INFO] ------------------------------------------------------------------------
[INFO] Building Apache Hadoop HDFS Project 3.0.0-SNAPSHOT
[INFO] ------------------------------------------------------------------------
[WARNING] The POM for org.eclipse.m2e:lifecycle-mapping:jar:1.0.0 is missing, no dependency
information available
[WARNING] Failed to retrieve plugin descriptor for org.eclipse.m2e:lifecycle-mapping:1.0.0:
Plugin org.eclipse.m2e:lifecycle-mapping:1.0.0 or one of its dependencies could not be resolved:
Failure to find org.eclipse.m2e:lifecycle-mapping:jar:1.0.0 in http://repo.maven.apache.org/maven2
was cached in the local repository, resolution will not be reattempted until the update interval
of central has elapsed or updates are forced
[INFO] 
[INFO] --- maven-clean-plugin:2.4.1:clean (default-clean) @ hadoop-hdfs-project ---
[INFO] Deleting <https://builds.apache.org/job/Hadoop-Hdfs-trunk-Java8/ws/hadoop-hdfs-project/target>
[INFO] 
[INFO] --- maven-antrun-plugin:1.7:run (create-testdirs) @ hadoop-hdfs-project ---
[INFO] Executing tasks

main:
    [mkdir] Created dir: <https://builds.apache.org/job/Hadoop-Hdfs-trunk-Java8/ws/hadoop-hdfs-project/target/test-dir>
[INFO] Executed tasks
[INFO] 
[INFO] --- maven-source-plugin:2.1.2:jar-no-fork (hadoop-java-sources) @ hadoop-hdfs-project
---
[INFO] 
[INFO] --- maven-source-plugin:2.1.2:test-jar-no-fork (hadoop-java-sources) @ hadoop-hdfs-project
---
[INFO] 
[INFO] --- maven-enforcer-plugin:1.3.1:enforce (dist-enforce) @ hadoop-hdfs-project ---
[INFO] 
[INFO] --- maven-site-plugin:3.4:attach-descriptor (attach-descriptor) @ hadoop-hdfs-project
---
[INFO] 
[INFO] --- maven-javadoc-plugin:2.8.1:jar (module-javadocs) @ hadoop-hdfs-project ---
[INFO] Not executing Javadoc as the project is not a Java classpath-capable package
[INFO] 
[INFO] --- maven-enforcer-plugin:1.3.1:enforce (depcheck) @ hadoop-hdfs-project ---
[INFO] 
[INFO] --- maven-checkstyle-plugin:2.6:checkstyle (default-cli) @ hadoop-hdfs-project ---
[INFO] 
[INFO] --- findbugs-maven-plugin:3.0.0:findbugs (default-cli) @ hadoop-hdfs-project ---
[INFO] ------------------------------------------------------------------------
[INFO] Reactor Summary:
[INFO] 
[INFO] Apache Hadoop HDFS ................................ FAILURE [  02:42 h]
[INFO] Apache Hadoop HttpFS .............................. SKIPPED
[INFO] Apache Hadoop HDFS BookKeeper Journal ............. SKIPPED
[INFO] Apache Hadoop HDFS-NFS ............................ SKIPPED
[INFO] Apache Hadoop HDFS Project ........................ SUCCESS [  1.621 s]
[INFO] ------------------------------------------------------------------------
[INFO] BUILD FAILURE
[INFO] ------------------------------------------------------------------------
[INFO] Total time: 02:42 h
[INFO] Finished at: 2015-01-29T14:17:31+00:00
[INFO] Final Memory: 47M/235M
[INFO] ------------------------------------------------------------------------
[ERROR] Failed to execute goal org.apache.maven.plugins:maven-surefire-plugin:2.17:test (default-test)
on project hadoop-hdfs: There are test failures.
[ERROR] 
[ERROR] Please refer to <https://builds.apache.org/job/Hadoop-Hdfs-trunk-Java8/ws/hadoop-hdfs-project/hadoop-hdfs/target/surefire-reports>
for the individual test results.
[ERROR] -> [Help 1]
[ERROR] 
[ERROR] To see the full stack trace of the errors, re-run Maven with the -e switch.
[ERROR] Re-run Maven using the -X switch to enable full debug logging.
[ERROR] 
[ERROR] For more information about the errors and possible solutions, please read the following
articles:
[ERROR] [Help 1] http://cwiki.apache.org/confluence/display/MAVEN/MojoFailureException
Build step 'Execute shell' marked build as failure
Archiving artifacts
Recording test results
Updating MAPREDUCE-6230
Updating YARN-3079
Updating HDFS-6673
Updating HDFS-7681
Updating HADOOP-11316
Updating HADOOP-11317
Updating HDFS-7611
Updating HDFS-7423
Updating YARN-3103
Updating HADOOP-10525

Mime
View raw message