hadoop-hdfs-dev mailing list archives

Site index · List index
Message view « Date » · « Thread »
Top « Date » · « Thread »
From Apache Jenkins Server <jenk...@builds.apache.org>
Subject Build failed in Jenkins: Hadoop-Hdfs-trunk #2014
Date Fri, 23 Jan 2015 12:35:35 GMT
See <https://builds.apache.org/job/Hadoop-Hdfs-trunk/2014/changes>

Changes:

[ozawa] HADOOP-11500. InputStream is left unclosed in ApplicationClassLoader. Contributed
by Ted Yu.

[arp] HDFS-7575. Upgrade should generate a unique storage ID for each volume. (Contributed
by Arpit Agarwal)

[aw] HADOOP-11008. Remove duplicated description about proxy-user in site documents (Masatake
Iwasaki via aw)

[arp] HDFS-7575. Fix CHANGES.txt

[cnauroth] HDFS-3519. Checkpoint upload may interfere with a concurrent saveNamespace. Contributed
by Ming Ma.

[aajisaka] HADOOP-11493. Fix some typos in kms-acls.xml description. (Contributed by Charles
Lamb)

[yliu] HDFS-7660. BlockReceiver#close() might be called multiple times, which causes the fsvolume
reference being released incorrectly. (Lei Xu via yliu)

[ozawa] YARN-3082. Non thread safe access to systemCredentials in NodeHeartbeatResponse processing.
Contributed by Anubhav Dhoot.

------------------------------------------
[...truncated 5440 lines...]
Tests run: 1, Failures: 0, Errors: 0, Skipped: 0, Time elapsed: 0.299 sec - in org.apache.hadoop.hdfs.qjournal.client.TestSegmentRecoveryComparator
Running org.apache.hadoop.hdfs.qjournal.client.TestEpochsAreUnique
Tests run: 1, Failures: 0, Errors: 0, Skipped: 0, Time elapsed: 7.47 sec - in org.apache.hadoop.hdfs.qjournal.client.TestEpochsAreUnique
Running org.apache.hadoop.hdfs.qjournal.client.TestIPCLoggerChannel
Tests run: 3, Failures: 0, Errors: 0, Skipped: 0, Time elapsed: 1.152 sec - in org.apache.hadoop.hdfs.qjournal.client.TestIPCLoggerChannel
Running org.apache.hadoop.hdfs.qjournal.TestMiniJournalCluster
Tests run: 1, Failures: 0, Errors: 0, Skipped: 0, Time elapsed: 1.867 sec - in org.apache.hadoop.hdfs.qjournal.TestMiniJournalCluster
Running org.apache.hadoop.hdfs.qjournal.TestNNWithQJM
Tests run: 3, Failures: 0, Errors: 0, Skipped: 0, Time elapsed: 6.992 sec - in org.apache.hadoop.hdfs.qjournal.TestNNWithQJM
Running org.apache.hadoop.hdfs.qjournal.server.TestJournalNodeMXBean
Tests run: 1, Failures: 0, Errors: 0, Skipped: 0, Time elapsed: 1.613 sec - in org.apache.hadoop.hdfs.qjournal.server.TestJournalNodeMXBean
Running org.apache.hadoop.hdfs.qjournal.server.TestJournalNode
Tests run: 6, Failures: 0, Errors: 0, Skipped: 0, Time elapsed: 16.13 sec - in org.apache.hadoop.hdfs.qjournal.server.TestJournalNode
Running org.apache.hadoop.hdfs.qjournal.server.TestJournal
Tests run: 12, Failures: 0, Errors: 0, Skipped: 0, Time elapsed: 1.735 sec - in org.apache.hadoop.hdfs.qjournal.server.TestJournal
Running org.apache.hadoop.hdfs.TestModTime
Tests run: 2, Failures: 0, Errors: 0, Skipped: 0, Time elapsed: 11.95 sec - in org.apache.hadoop.hdfs.TestModTime
Running org.apache.hadoop.hdfs.security.token.block.TestBlockToken
Tests run: 6, Failures: 0, Errors: 0, Skipped: 0, Time elapsed: 7.206 sec - in org.apache.hadoop.hdfs.security.token.block.TestBlockToken
Running org.apache.hadoop.hdfs.security.TestClientProtocolWithDelegationToken
Tests run: 1, Failures: 0, Errors: 0, Skipped: 0, Time elapsed: 1.692 sec - in org.apache.hadoop.hdfs.security.TestClientProtocolWithDelegationToken
Running org.apache.hadoop.hdfs.security.TestDelegationToken
Tests run: 6, Failures: 0, Errors: 0, Skipped: 0, Time elapsed: 30.068 sec - in org.apache.hadoop.hdfs.security.TestDelegationToken
Running org.apache.hadoop.hdfs.security.TestDelegationTokenForProxyUser
Tests run: 2, Failures: 0, Errors: 0, Skipped: 0, Time elapsed: 5.3 sec - in org.apache.hadoop.hdfs.security.TestDelegationTokenForProxyUser
Running org.apache.hadoop.hdfs.TestLocalDFS
Tests run: 2, Failures: 0, Errors: 0, Skipped: 0, Time elapsed: 5.738 sec - in org.apache.hadoop.hdfs.TestLocalDFS
Running org.apache.hadoop.hdfs.TestFileLengthOnClusterRestart
Tests run: 1, Failures: 0, Errors: 0, Skipped: 0, Time elapsed: 10.332 sec - in org.apache.hadoop.hdfs.TestFileLengthOnClusterRestart
Running org.apache.hadoop.hdfs.TestFileCreationClient
Tests run: 1, Failures: 0, Errors: 0, Skipped: 0, Time elapsed: 40.161 sec - in org.apache.hadoop.hdfs.TestFileCreationClient
Running org.apache.hadoop.hdfs.TestQuota
Tests run: 7, Failures: 0, Errors: 0, Skipped: 0, Time elapsed: 12.353 sec - in org.apache.hadoop.hdfs.TestQuota
Running org.apache.hadoop.hdfs.TestRead
Tests run: 3, Failures: 0, Errors: 0, Skipped: 0, Time elapsed: 5.594 sec - in org.apache.hadoop.hdfs.TestRead
Running org.apache.hadoop.hdfs.TestFileCreationEmpty
Tests run: 1, Failures: 0, Errors: 0, Skipped: 0, Time elapsed: 8.967 sec - in org.apache.hadoop.hdfs.TestFileCreationEmpty
Running org.apache.hadoop.hdfs.tools.TestDFSAdminWithHA
Tests run: 10, Failures: 0, Errors: 0, Skipped: 0, Time elapsed: 19.17 sec - in org.apache.hadoop.hdfs.tools.TestDFSAdminWithHA
Running org.apache.hadoop.hdfs.tools.TestDebugAdmin
Tests run: 2, Failures: 0, Errors: 0, Skipped: 0, Time elapsed: 4.975 sec - in org.apache.hadoop.hdfs.tools.TestDebugAdmin
Running org.apache.hadoop.hdfs.tools.TestDFSHAAdmin
Tests run: 20, Failures: 0, Errors: 0, Skipped: 0, Time elapsed: 2.439 sec - in org.apache.hadoop.hdfs.tools.TestDFSHAAdmin
Running org.apache.hadoop.hdfs.tools.TestStoragePolicyCommands
Tests run: 1, Failures: 0, Errors: 0, Skipped: 0, Time elapsed: 4.329 sec - in org.apache.hadoop.hdfs.tools.TestStoragePolicyCommands
Running org.apache.hadoop.hdfs.tools.TestDFSHAAdminMiniCluster
Tests run: 6, Failures: 0, Errors: 0, Skipped: 0, Time elapsed: 7.122 sec - in org.apache.hadoop.hdfs.tools.TestDFSHAAdminMiniCluster
Running org.apache.hadoop.hdfs.tools.offlineEditsViewer.TestOfflineEditsViewer
Tests run: 3, Failures: 0, Errors: 0, Skipped: 0, Time elapsed: 11.908 sec - in org.apache.hadoop.hdfs.tools.offlineEditsViewer.TestOfflineEditsViewer
Running org.apache.hadoop.hdfs.tools.TestDFSAdmin
Tests run: 1, Failures: 0, Errors: 0, Skipped: 0, Time elapsed: 3.774 sec - in org.apache.hadoop.hdfs.tools.TestDFSAdmin
Running org.apache.hadoop.hdfs.tools.TestGetGroups
Tests run: 6, Failures: 0, Errors: 0, Skipped: 0, Time elapsed: 4.888 sec - in org.apache.hadoop.hdfs.tools.TestGetGroups
Running org.apache.hadoop.hdfs.tools.TestGetConf
Tests run: 10, Failures: 0, Errors: 0, Skipped: 0, Time elapsed: 1.274 sec - in org.apache.hadoop.hdfs.tools.TestGetConf
Running org.apache.hadoop.hdfs.tools.TestDelegationTokenFetcher
Tests run: 2, Failures: 0, Errors: 0, Skipped: 0, Time elapsed: 1.211 sec - in org.apache.hadoop.hdfs.tools.TestDelegationTokenFetcher
Running org.apache.hadoop.hdfs.tools.offlineImageViewer.TestOfflineImageViewerForAcl
Tests run: 1, Failures: 0, Errors: 0, Skipped: 0, Time elapsed: 4.433 sec - in org.apache.hadoop.hdfs.tools.offlineImageViewer.TestOfflineImageViewerForAcl
Running org.apache.hadoop.hdfs.tools.offlineImageViewer.TestOfflineImageViewer
Tests run: 5, Failures: 0, Errors: 0, Skipped: 0, Time elapsed: 4.868 sec - in org.apache.hadoop.hdfs.tools.offlineImageViewer.TestOfflineImageViewer
Running org.apache.hadoop.hdfs.TestFileCreation
Tests run: 23, Failures: 0, Errors: 0, Skipped: 0, Time elapsed: 380.033 sec - in org.apache.hadoop.hdfs.TestFileCreation
Running org.apache.hadoop.hdfs.TestLargeBlock
Tests run: 1, Failures: 0, Errors: 0, Skipped: 0, Time elapsed: 13.898 sec - in org.apache.hadoop.hdfs.TestLargeBlock
Running org.apache.hadoop.hdfs.TestFileCorruption
Tests run: 3, Failures: 0, Errors: 0, Skipped: 0, Time elapsed: 11.943 sec - in org.apache.hadoop.hdfs.TestFileCorruption
Running org.apache.hadoop.hdfs.TestLease
Tests run: 5, Failures: 0, Errors: 0, Skipped: 0, Time elapsed: 8.192 sec - in org.apache.hadoop.hdfs.TestLease
Running org.apache.hadoop.hdfs.TestSetrepDecreasing
Tests run: 1, Failures: 0, Errors: 0, Skipped: 0, Time elapsed: 15.802 sec - in org.apache.hadoop.hdfs.TestSetrepDecreasing
Running org.apache.hadoop.hdfs.TestParallelUnixDomainRead
Tests run: 4, Failures: 0, Errors: 0, Skipped: 0, Time elapsed: 35.171 sec - in org.apache.hadoop.hdfs.TestParallelUnixDomainRead
Running org.apache.hadoop.hdfs.TestReadWhileWriting
Tests run: 1, Failures: 0, Errors: 0, Skipped: 0, Time elapsed: 6.338 sec - in org.apache.hadoop.hdfs.TestReadWhileWriting
Running org.apache.hadoop.hdfs.TestBlockReaderFactory
Tests run: 7, Failures: 0, Errors: 0, Skipped: 0, Time elapsed: 10.888 sec - in org.apache.hadoop.hdfs.TestBlockReaderFactory
Running org.apache.hadoop.hdfs.TestClose
Tests run: 1, Failures: 0, Errors: 0, Skipped: 0, Time elapsed: 4.033 sec - in org.apache.hadoop.hdfs.TestClose
Running org.apache.hadoop.hdfs.TestBalancerBandwidth
Tests run: 1, Failures: 0, Errors: 0, Skipped: 0, Time elapsed: 13.54 sec - in org.apache.hadoop.hdfs.TestBalancerBandwidth
Running org.apache.hadoop.hdfs.TestDFSShellGenericOptions
Tests run: 1, Failures: 0, Errors: 0, Skipped: 0, Time elapsed: 3.797 sec - in org.apache.hadoop.hdfs.TestDFSShellGenericOptions
Running org.apache.hadoop.hdfs.TestParallelShortCircuitReadNoChecksum
Tests run: 4, Failures: 0, Errors: 0, Skipped: 0, Time elapsed: 13.501 sec - in org.apache.hadoop.hdfs.TestParallelShortCircuitReadNoChecksum
Running org.apache.hadoop.hdfs.TestDFSFinalize
Tests run: 1, Failures: 0, Errors: 0, Skipped: 0, Time elapsed: 16.788 sec - in org.apache.hadoop.hdfs.TestDFSFinalize
Running org.apache.hadoop.hdfs.TestAbandonBlock
Tests run: 2, Failures: 0, Errors: 0, Skipped: 0, Time elapsed: 10.806 sec - in org.apache.hadoop.hdfs.TestAbandonBlock
Running org.apache.hadoop.hdfs.TestMissingBlocksAlert
Tests run: 1, Failures: 0, Errors: 0, Skipped: 0, Time elapsed: 4.287 sec - in org.apache.hadoop.hdfs.TestMissingBlocksAlert
Running org.apache.hadoop.hdfs.TestHDFSServerPorts
Tests run: 4, Failures: 0, Errors: 0, Skipped: 0, Time elapsed: 6.381 sec - in org.apache.hadoop.hdfs.TestHDFSServerPorts
Running org.apache.hadoop.hdfs.TestParallelShortCircuitRead
Tests run: 4, Failures: 0, Errors: 0, Skipped: 0, Time elapsed: 12.661 sec - in org.apache.hadoop.hdfs.TestParallelShortCircuitRead
Running org.apache.hadoop.hdfs.TestIsMethodSupported
Tests run: 10, Failures: 0, Errors: 0, Skipped: 0, Time elapsed: 3.751 sec - in org.apache.hadoop.hdfs.TestIsMethodSupported
Running org.apache.hadoop.hdfs.TestAppendDifferentChecksum
Tests run: 3, Failures: 0, Errors: 0, Skipped: 1, Time elapsed: 8.798 sec - in org.apache.hadoop.hdfs.TestAppendDifferentChecksum
Running org.apache.hadoop.hdfs.TestFsShellPermission
Tests run: 1, Failures: 0, Errors: 0, Skipped: 0, Time elapsed: 4.548 sec - in org.apache.hadoop.hdfs.TestFsShellPermission
Running org.apache.hadoop.hdfs.TestFileAppend2
Tests run: 2, Failures: 0, Errors: 0, Skipped: 0, Time elapsed: 13.386 sec - in org.apache.hadoop.hdfs.TestFileAppend2
Running org.apache.hadoop.hdfs.TestFileAppend3
Tests run: 8, Failures: 0, Errors: 0, Skipped: 0, Time elapsed: 6.457 sec - in org.apache.hadoop.hdfs.TestFileAppend3
Running org.apache.hadoop.hdfs.TestWriteBlockGetsBlockLengthHint
Tests run: 1, Failures: 0, Errors: 0, Skipped: 0, Time elapsed: 3.929 sec - in org.apache.hadoop.hdfs.TestWriteBlockGetsBlockLengthHint
Running org.apache.hadoop.hdfs.TestDFSRename
Tests run: 2, Failures: 0, Errors: 0, Skipped: 0, Time elapsed: 10.961 sec - in org.apache.hadoop.hdfs.TestDFSRename
Running org.apache.hadoop.hdfs.TestFileConcurrentReader
Tests run: 7, Failures: 0, Errors: 0, Skipped: 0, Time elapsed: 21.007 sec - in org.apache.hadoop.hdfs.TestFileConcurrentReader
Running org.apache.hadoop.hdfs.TestDecommission
Tests run: 12, Failures: 0, Errors: 0, Skipped: 0, Time elapsed: 180.123 sec - in org.apache.hadoop.hdfs.TestDecommission
Running org.apache.hadoop.hdfs.server.common.TestJspHelper
Tests run: 9, Failures: 0, Errors: 0, Skipped: 0, Time elapsed: 1.629 sec - in org.apache.hadoop.hdfs.server.common.TestJspHelper
Running org.apache.hadoop.hdfs.server.common.TestGetUriFromString
Tests run: 3, Failures: 0, Errors: 0, Skipped: 0, Time elapsed: 0.189 sec - in org.apache.hadoop.hdfs.server.common.TestGetUriFromString
Running org.apache.hadoop.hdfs.server.blockmanagement.TestSequentialBlockId
Tests run: 4, Failures: 0, Errors: 0, Skipped: 0, Time elapsed: 5.015 sec - in org.apache.hadoop.hdfs.server.blockmanagement.TestSequentialBlockId
Running org.apache.hadoop.hdfs.server.blockmanagement.TestBlocksWithNotEnoughRacks
Tests run: 9, Failures: 0, Errors: 0, Skipped: 0, Time elapsed: 39.794 sec - in org.apache.hadoop.hdfs.server.blockmanagement.TestBlocksWithNotEnoughRacks
Running org.apache.hadoop.hdfs.server.blockmanagement.TestBlockInfoUnderConstruction
Tests run: 1, Failures: 0, Errors: 0, Skipped: 0, Time elapsed: 0.312 sec - in org.apache.hadoop.hdfs.server.blockmanagement.TestBlockInfoUnderConstruction
Running org.apache.hadoop.hdfs.server.blockmanagement.TestBlockTokenWithDFS
Tests run: 4, Failures: 0, Errors: 0, Skipped: 0, Time elapsed: 20.574 sec - in org.apache.hadoop.hdfs.server.blockmanagement.TestBlockTokenWithDFS
Running org.apache.hadoop.hdfs.server.blockmanagement.TestNodeCount
Tests run: 1, Failures: 0, Errors: 0, Skipped: 0, Time elapsed: 14.917 sec - in org.apache.hadoop.hdfs.server.blockmanagement.TestNodeCount
Running org.apache.hadoop.hdfs.server.blockmanagement.TestReplicationPolicyWithNodeGroup
Tests run: 13, Failures: 0, Errors: 0, Skipped: 0, Time elapsed: 8.077 sec - in org.apache.hadoop.hdfs.server.blockmanagement.TestReplicationPolicyWithNodeGroup
Running org.apache.hadoop.hdfs.server.blockmanagement.TestReplicationPolicy
Tests run: 25, Failures: 0, Errors: 0, Skipped: 0, Time elapsed: 8.127 sec - in org.apache.hadoop.hdfs.server.blockmanagement.TestReplicationPolicy
Running org.apache.hadoop.hdfs.server.blockmanagement.TestUnderReplicatedBlocks
Tests run: 2, Failures: 0, Errors: 0, Skipped: 0, Time elapsed: 20.589 sec - in org.apache.hadoop.hdfs.server.blockmanagement.TestUnderReplicatedBlocks
Running org.apache.hadoop.hdfs.server.blockmanagement.TestBlockManager
Tests run: 11, Failures: 0, Errors: 0, Skipped: 0, Time elapsed: 5.513 sec - in org.apache.hadoop.hdfs.server.blockmanagement.TestBlockManager
Running org.apache.hadoop.hdfs.server.blockmanagement.TestPendingInvalidateBlock
Tests run: 2, Failures: 0, Errors: 0, Skipped: 0, Time elapsed: 31.182 sec - in org.apache.hadoop.hdfs.server.blockmanagement.TestPendingInvalidateBlock
Running org.apache.hadoop.hdfs.server.blockmanagement.TestDatanodeDescriptor
Tests run: 2, Failures: 0, Errors: 0, Skipped: 0, Time elapsed: 0.274 sec - in org.apache.hadoop.hdfs.server.blockmanagement.TestDatanodeDescriptor
Running org.apache.hadoop.hdfs.server.blockmanagement.TestPendingDataNodeMessages
Tests run: 1, Failures: 0, Errors: 0, Skipped: 0, Time elapsed: 0.277 sec - in org.apache.hadoop.hdfs.server.blockmanagement.TestPendingDataNodeMessages
Running org.apache.hadoop.hdfs.server.blockmanagement.TestComputeInvalidateWork
Tests run: 3, Failures: 0, Errors: 0, Skipped: 0, Time elapsed: 8.331 sec - in org.apache.hadoop.hdfs.server.blockmanagement.TestComputeInvalidateWork
Running org.apache.hadoop.hdfs.server.blockmanagement.TestCachedBlocksList
Tests run: 2, Failures: 0, Errors: 0, Skipped: 0, Time elapsed: 0.317 sec - in org.apache.hadoop.hdfs.server.blockmanagement.TestCachedBlocksList
Running org.apache.hadoop.hdfs.server.blockmanagement.TestBlockInfo
Tests run: 3, Failures: 0, Errors: 0, Skipped: 0, Time elapsed: 0.269 sec - in org.apache.hadoop.hdfs.server.blockmanagement.TestBlockInfo
Running org.apache.hadoop.hdfs.server.blockmanagement.TestNameNodePrunesMissingStorages
Tests run: 2, Failures: 0, Errors: 0, Skipped: 0, Time elapsed: 5.082 sec - in org.apache.hadoop.hdfs.server.blockmanagement.TestNameNodePrunesMissingStorages
Running org.apache.hadoop.hdfs.server.blockmanagement.TestRBWBlockInvalidation
Tests run: 2, Failures: 0, Errors: 0, Skipped: 0, Time elapsed: 14.37 sec - in org.apache.hadoop.hdfs.server.blockmanagement.TestRBWBlockInvalidation
Running org.apache.hadoop.hdfs.server.blockmanagement.TestHost2NodesMap
Tests run: 3, Failures: 0, Errors: 0, Skipped: 0, Time elapsed: 0.284 sec - in org.apache.hadoop.hdfs.server.blockmanagement.TestHost2NodesMap
Running org.apache.hadoop.hdfs.server.blockmanagement.TestReplicationPolicyConsiderLoad
Tests run: 1, Failures: 0, Errors: 0, Skipped: 0, Time elapsed: 2.482 sec - in org.apache.hadoop.hdfs.server.blockmanagement.TestReplicationPolicyConsiderLoad
Running org.apache.hadoop.hdfs.server.blockmanagement.TestHeartbeatHandling
Tests run: 2, Failures: 0, Errors: 0, Skipped: 0, Time elapsed: 4.648 sec - in org.apache.hadoop.hdfs.server.blockmanagement.TestHeartbeatHandling
Running org.apache.hadoop.hdfs.server.blockmanagement.TestOverReplicatedBlocks
Tests run: 3, Failures: 0, Errors: 0, Skipped: 0, Time elapsed: 23.229 sec - in org.apache.hadoop.hdfs.server.blockmanagement.TestOverReplicatedBlocks
Running org.apache.hadoop.hdfs.server.blockmanagement.TestHostFileManager
Tests run: 3, Failures: 0, Errors: 0, Skipped: 0, Time elapsed: 1.187 sec - in org.apache.hadoop.hdfs.server.blockmanagement.TestHostFileManager
Running org.apache.hadoop.hdfs.server.blockmanagement.TestDatanodeManager

Results :

Tests run: 1201, Failures: 0, Errors: 0, Skipped: 4

[INFO]                                                                         
[INFO] ------------------------------------------------------------------------
[INFO] Skipping Apache Hadoop HttpFS
[INFO] This project has been banned from the build due to previous failures.
[INFO] ------------------------------------------------------------------------
[INFO]                                                                         
[INFO] ------------------------------------------------------------------------
[INFO] Skipping Apache Hadoop HDFS BookKeeper Journal
[INFO] This project has been banned from the build due to previous failures.
[INFO] ------------------------------------------------------------------------
[INFO]                                                                         
[INFO] ------------------------------------------------------------------------
[INFO] Skipping Apache Hadoop HDFS-NFS
[INFO] This project has been banned from the build due to previous failures.
[INFO] ------------------------------------------------------------------------
[INFO]                                                                         
[INFO] ------------------------------------------------------------------------
[INFO] Building Apache Hadoop HDFS Project 3.0.0-SNAPSHOT
[INFO] ------------------------------------------------------------------------
[WARNING] The POM for org.eclipse.m2e:lifecycle-mapping:jar:1.0.0 is missing, no dependency
information available
[WARNING] Failed to retrieve plugin descriptor for org.eclipse.m2e:lifecycle-mapping:1.0.0:
Plugin org.eclipse.m2e:lifecycle-mapping:1.0.0 or one of its dependencies could not be resolved:
Failure to find org.eclipse.m2e:lifecycle-mapping:jar:1.0.0 in http://repo.maven.apache.org/maven2
was cached in the local repository, resolution will not be reattempted until the update interval
of central has elapsed or updates are forced
[INFO] 
[INFO] --- maven-clean-plugin:2.4.1:clean (default-clean) @ hadoop-hdfs-project ---
[INFO] Deleting <https://builds.apache.org/job/Hadoop-Hdfs-trunk/ws/hadoop-hdfs-project/target>
[INFO] 
[INFO] --- maven-antrun-plugin:1.7:run (create-testdirs) @ hadoop-hdfs-project ---
[INFO] Executing tasks

main:
    [mkdir] Created dir: <https://builds.apache.org/job/Hadoop-Hdfs-trunk/ws/hadoop-hdfs-project/target/test-dir>
[INFO] Executed tasks
[INFO] 
[INFO] --- maven-source-plugin:2.1.2:jar-no-fork (hadoop-java-sources) @ hadoop-hdfs-project
---
[INFO] 
[INFO] --- maven-source-plugin:2.1.2:test-jar-no-fork (hadoop-java-sources) @ hadoop-hdfs-project
---
[INFO] 
[INFO] --- maven-enforcer-plugin:1.3.1:enforce (dist-enforce) @ hadoop-hdfs-project ---
[INFO] 
[INFO] --- maven-site-plugin:3.4:attach-descriptor (attach-descriptor) @ hadoop-hdfs-project
---
[INFO] 
[INFO] --- maven-javadoc-plugin:2.8.1:jar (module-javadocs) @ hadoop-hdfs-project ---
[INFO] Skipping javadoc generation
[INFO] 
[INFO] --- maven-enforcer-plugin:1.3.1:enforce (depcheck) @ hadoop-hdfs-project ---
[INFO] 
[INFO] --- maven-checkstyle-plugin:2.6:checkstyle (default-cli) @ hadoop-hdfs-project ---
[INFO] 
[INFO] --- findbugs-maven-plugin:3.0.0:findbugs (default-cli) @ hadoop-hdfs-project ---
[INFO] ------------------------------------------------------------------------
[INFO] Reactor Summary:
[INFO] 
[INFO] Apache Hadoop HDFS ................................ FAILURE [  01:01 h]
[INFO] Apache Hadoop HttpFS .............................. SKIPPED
[INFO] Apache Hadoop HDFS BookKeeper Journal ............. SKIPPED
[INFO] Apache Hadoop HDFS-NFS ............................ SKIPPED
[INFO] Apache Hadoop HDFS Project ........................ SUCCESS [  2.399 s]
[INFO] ------------------------------------------------------------------------
[INFO] BUILD FAILURE
[INFO] ------------------------------------------------------------------------
[INFO] Total time: 01:01 h
[INFO] Finished at: 2015-01-23T12:35:27+00:00
[INFO] Final Memory: 71M/1100M
[INFO] ------------------------------------------------------------------------
[ERROR] Failed to execute goal org.apache.maven.plugins:maven-surefire-plugin:2.17:test (default-test)
on project hadoop-hdfs: ExecutionException: java.lang.RuntimeException: The forked VM terminated
without properly saying goodbye. VM crash or System.exit called?
[ERROR] Command was /bin/sh -c cd <https://builds.apache.org/job/Hadoop-Hdfs-trunk/ws/hadoop-hdfs-project/hadoop-hdfs>
&& /home/jenkins/tools/java/jdk1.7.0_55/jre/bin/java -Xmx4096m -XX:MaxPermSize=768m
-XX:+HeapDumpOnOutOfMemoryError -jar <https://builds.apache.org/job/Hadoop-Hdfs-trunk/ws/hadoop-hdfs-project/hadoop-hdfs/target/surefire/surefirebooter8716015324946851387.jar>
<https://builds.apache.org/job/Hadoop-Hdfs-trunk/ws/hadoop-hdfs-project/hadoop-hdfs/target/surefire/surefire6845744502488481649tmp>
<https://builds.apache.org/job/Hadoop-Hdfs-trunk/ws/hadoop-hdfs-project/hadoop-hdfs/target/surefire/surefire_0101351074586690658tmp>
[ERROR] -> [Help 1]
[ERROR] 
[ERROR] To see the full stack trace of the errors, re-run Maven with the -e switch.
[ERROR] Re-run Maven using the -X switch to enable full debug logging.
[ERROR] 
[ERROR] For more information about the errors and possible solutions, please read the following
articles:
[ERROR] [Help 1] http://cwiki.apache.org/confluence/display/MAVEN/MojoFailureException
Build step 'Execute shell' marked build as failure
Archiving artifacts
Recording test results
Updating HADOOP-11493
Updating HDFS-7575
Updating HADOOP-11500
Updating HDFS-3519
Updating YARN-3082
Updating HDFS-7660
Updating HADOOP-11008

Mime
View raw message