hadoop-hdfs-dev mailing list archives

Site index · List index
Message view « Date » · « Thread »
Top « Date » · « Thread »
From Apache Jenkins Server <jenk...@builds.apache.org>
Subject Build failed in Jenkins: Hadoop-Hdfs-trunk-Java8 #31
Date Mon, 08 Dec 2014 00:49:43 GMT
See <https://builds.apache.org/job/Hadoop-Hdfs-trunk-Java8/31/>

------------------------------------------
[...truncated 6055 lines...]
Running org.apache.hadoop.hdfs.TestLocalDFS
Tests run: 2, Failures: 0, Errors: 0, Skipped: 0, Time elapsed: 5.649 sec - in org.apache.hadoop.hdfs.TestLocalDFS
Running org.apache.hadoop.hdfs.TestPeerCache
Tests run: 5, Failures: 0, Errors: 0, Skipped: 0, Time elapsed: 1.343 sec - in org.apache.hadoop.hdfs.TestPeerCache
Running org.apache.hadoop.hdfs.TestHFlush
Tests run: 9, Failures: 0, Errors: 0, Skipped: 0, Time elapsed: 23.706 sec - in org.apache.hadoop.hdfs.TestHFlush
Running org.apache.hadoop.hdfs.TestDFSFinalize
Tests run: 1, Failures: 0, Errors: 0, Skipped: 0, Time elapsed: 15.968 sec - in org.apache.hadoop.hdfs.TestDFSFinalize
Running org.apache.hadoop.hdfs.TestDatanodeRegistration
Tests run: 5, Failures: 0, Errors: 0, Skipped: 0, Time elapsed: 8.553 sec - in org.apache.hadoop.hdfs.TestDatanodeRegistration
Running org.apache.hadoop.hdfs.TestRenameWhileOpen
Tests run: 4, Failures: 0, Errors: 0, Skipped: 0, Time elapsed: 46.658 sec - in org.apache.hadoop.hdfs.TestRenameWhileOpen
Running org.apache.hadoop.hdfs.TestAbandonBlock
Tests run: 2, Failures: 0, Errors: 0, Skipped: 0, Time elapsed: 10.866 sec - in org.apache.hadoop.hdfs.TestAbandonBlock
Running org.apache.hadoop.hdfs.TestDFSRollback
Tests run: 1, Failures: 0, Errors: 0, Skipped: 0, Time elapsed: 12.613 sec - in org.apache.hadoop.hdfs.TestDFSRollback
Running org.apache.hadoop.hdfs.TestReservedRawPaths
Tests run: 8, Failures: 0, Errors: 0, Skipped: 0, Time elapsed: 8.961 sec - in org.apache.hadoop.hdfs.TestReservedRawPaths
Running org.apache.hadoop.hdfs.TestLeaseRecovery
Tests run: 2, Failures: 0, Errors: 0, Skipped: 0, Time elapsed: 18.572 sec - in org.apache.hadoop.hdfs.TestLeaseRecovery
Running org.apache.hadoop.hdfs.TestEncryptionZones
Tests run: 18, Failures: 0, Errors: 0, Skipped: 0, Time elapsed: 36.753 sec - in org.apache.hadoop.hdfs.TestEncryptionZones
Running org.apache.hadoop.hdfs.TestSmallBlock
Tests run: 2, Failures: 0, Errors: 0, Skipped: 0, Time elapsed: 4.673 sec - in org.apache.hadoop.hdfs.TestSmallBlock
Running org.apache.hadoop.hdfs.TestLeaseRecovery2
Tests run: 7, Failures: 0, Errors: 0, Skipped: 0, Time elapsed: 179.024 sec - in org.apache.hadoop.hdfs.TestLeaseRecovery2
Running org.apache.hadoop.hdfs.TestDFSMkdirs
Tests run: 3, Failures: 0, Errors: 0, Skipped: 0, Time elapsed: 5.727 sec - in org.apache.hadoop.hdfs.TestDFSMkdirs
Running org.apache.hadoop.hdfs.TestSetTimes
Tests run: 3, Failures: 0, Errors: 0, Skipped: 0, Time elapsed: 9.844 sec - in org.apache.hadoop.hdfs.TestSetTimes
Running org.apache.hadoop.hdfs.TestFileStatus
Tests run: 5, Failures: 0, Errors: 0, Skipped: 0, Time elapsed: 4.035 sec - in org.apache.hadoop.hdfs.TestFileStatus
Running org.apache.hadoop.hdfs.TestEncryptionZonesWithHA
Tests run: 1, Failures: 0, Errors: 0, Skipped: 0, Time elapsed: 5.962 sec - in org.apache.hadoop.hdfs.TestEncryptionZonesWithHA
Running org.apache.hadoop.hdfs.TestRollingUpgradeRollback
Tests run: 3, Failures: 0, Errors: 0, Skipped: 0, Time elapsed: 8.449 sec - in org.apache.hadoop.hdfs.TestRollingUpgradeRollback
Running org.apache.hadoop.hdfs.TestDFSStartupVersions
Tests run: 1, Failures: 0, Errors: 0, Skipped: 0, Time elapsed: 10.814 sec - in org.apache.hadoop.hdfs.TestDFSStartupVersions
Running org.apache.hadoop.hdfs.TestDFSShellGenericOptions
Tests run: 1, Failures: 0, Errors: 0, Skipped: 0, Time elapsed: 3.448 sec - in org.apache.hadoop.hdfs.TestDFSShellGenericOptions
Running org.apache.hadoop.hdfs.protocolPB.TestPBHelper
Tests run: 28, Failures: 0, Errors: 0, Skipped: 0, Time elapsed: 0.821 sec - in org.apache.hadoop.hdfs.protocolPB.TestPBHelper
Running org.apache.hadoop.hdfs.TestLeaseRenewer
Tests run: 4, Failures: 0, Errors: 0, Skipped: 0, Time elapsed: 1.159 sec - in org.apache.hadoop.hdfs.TestLeaseRenewer
Running org.apache.hadoop.hdfs.TestDatanodeBlockScanner
Tests run: 7, Failures: 0, Errors: 0, Skipped: 0, Time elapsed: 155.096 sec - in org.apache.hadoop.hdfs.TestDatanodeBlockScanner
Running org.apache.hadoop.hdfs.TestDFSRemove
Tests run: 1, Failures: 0, Errors: 0, Skipped: 0, Time elapsed: 14.451 sec - in org.apache.hadoop.hdfs.TestDFSRemove
Running org.apache.hadoop.hdfs.TestFileAppend4
Tests run: 4, Failures: 0, Errors: 0, Skipped: 0, Time elapsed: 29.753 sec - in org.apache.hadoop.hdfs.TestFileAppend4
Running org.apache.hadoop.hdfs.TestParallelRead
Tests run: 4, Failures: 0, Errors: 0, Skipped: 0, Time elapsed: 34.67 sec - in org.apache.hadoop.hdfs.TestParallelRead
Running org.apache.hadoop.hdfs.TestClose
Tests run: 1, Failures: 0, Errors: 0, Skipped: 0, Time elapsed: 3.917 sec - in org.apache.hadoop.hdfs.TestClose
Running org.apache.hadoop.hdfs.TestDFSAddressConfig
Tests run: 1, Failures: 0, Errors: 0, Skipped: 0, Time elapsed: 4.298 sec - in org.apache.hadoop.hdfs.TestDFSAddressConfig
Running org.apache.hadoop.hdfs.TestParallelShortCircuitLegacyRead
Tests run: 4, Failures: 0, Errors: 0, Skipped: 0, Time elapsed: 12.879 sec - in org.apache.hadoop.hdfs.TestParallelShortCircuitLegacyRead
Running org.apache.hadoop.hdfs.TestLargeBlock
Tests run: 1, Failures: 0, Errors: 0, Skipped: 0, Time elapsed: 12.841 sec - in org.apache.hadoop.hdfs.TestLargeBlock
Running org.apache.hadoop.hdfs.TestHDFSTrash
Tests run: 2, Failures: 0, Errors: 0, Skipped: 0, Time elapsed: 6.012 sec - in org.apache.hadoop.hdfs.TestHDFSTrash
Running org.apache.hadoop.hdfs.TestClientReportBadBlock
Tests run: 3, Failures: 0, Errors: 0, Skipped: 0, Time elapsed: 8.105 sec - in org.apache.hadoop.hdfs.TestClientReportBadBlock
Running org.apache.hadoop.hdfs.TestWriteRead
Tests run: 3, Failures: 0, Errors: 0, Skipped: 0, Time elapsed: 20.107 sec - in org.apache.hadoop.hdfs.TestWriteRead
Running org.apache.hadoop.hdfs.TestClientProtocolForPipelineRecovery
Tests run: 4, Failures: 0, Errors: 0, Skipped: 0, Time elapsed: 33.431 sec - in org.apache.hadoop.hdfs.TestClientProtocolForPipelineRecovery
Running org.apache.hadoop.hdfs.TestBalancerBandwidth
Tests run: 1, Failures: 0, Errors: 0, Skipped: 0, Time elapsed: 13.385 sec - in org.apache.hadoop.hdfs.TestBalancerBandwidth
Running org.apache.hadoop.hdfs.TestDFSUpgrade
Tests run: 2, Failures: 0, Errors: 0, Skipped: 0, Time elapsed: 12.87 sec - in org.apache.hadoop.hdfs.TestDFSUpgrade
Running org.apache.hadoop.hdfs.TestBlockStoragePolicy
Tests run: 16, Failures: 0, Errors: 0, Skipped: 0, Time elapsed: 34.999 sec - in org.apache.hadoop.hdfs.TestBlockStoragePolicy
Running org.apache.hadoop.hdfs.TestFileLengthOnClusterRestart
Tests run: 1, Failures: 0, Errors: 0, Skipped: 0, Time elapsed: 10.191 sec - in org.apache.hadoop.hdfs.TestFileLengthOnClusterRestart
Running org.apache.hadoop.hdfs.TestBlockReaderFactory
Tests run: 7, Failures: 0, Errors: 0, Skipped: 0, Time elapsed: 11.346 sec - in org.apache.hadoop.hdfs.TestBlockReaderFactory
Running org.apache.hadoop.hdfs.qjournal.TestSecureNNWithQJM
Tests run: 2, Failures: 0, Errors: 0, Skipped: 0, Time elapsed: 36.609 sec - in org.apache.hadoop.hdfs.qjournal.TestSecureNNWithQJM
Running org.apache.hadoop.hdfs.qjournal.TestNNWithQJM
Tests run: 3, Failures: 0, Errors: 0, Skipped: 0, Time elapsed: 6.747 sec - in org.apache.hadoop.hdfs.qjournal.TestNNWithQJM
Running org.apache.hadoop.hdfs.qjournal.server.TestJournalNodeMXBean
Tests run: 1, Failures: 0, Errors: 0, Skipped: 0, Time elapsed: 1.302 sec - in org.apache.hadoop.hdfs.qjournal.server.TestJournalNodeMXBean
Running org.apache.hadoop.hdfs.qjournal.server.TestJournal
Tests run: 12, Failures: 0, Errors: 0, Skipped: 0, Time elapsed: 1.461 sec - in org.apache.hadoop.hdfs.qjournal.server.TestJournal
Running org.apache.hadoop.hdfs.qjournal.server.TestJournalNode
Tests run: 6, Failures: 0, Errors: 0, Skipped: 0, Time elapsed: 5.26 sec - in org.apache.hadoop.hdfs.qjournal.server.TestJournalNode
Running org.apache.hadoop.hdfs.qjournal.client.TestIPCLoggerChannel
Tests run: 3, Failures: 0, Errors: 0, Skipped: 0, Time elapsed: 0.866 sec - in org.apache.hadoop.hdfs.qjournal.client.TestIPCLoggerChannel
Running org.apache.hadoop.hdfs.qjournal.client.TestQJMWithFaults
Tests run: 2, Failures: 0, Errors: 0, Skipped: 0, Time elapsed: 147.85 sec - in org.apache.hadoop.hdfs.qjournal.client.TestQJMWithFaults
Running org.apache.hadoop.hdfs.qjournal.client.TestEpochsAreUnique
Tests run: 1, Failures: 0, Errors: 0, Skipped: 0, Time elapsed: 6.346 sec - in org.apache.hadoop.hdfs.qjournal.client.TestEpochsAreUnique
Running org.apache.hadoop.hdfs.qjournal.client.TestQuorumJournalManagerUnit
Tests run: 6, Failures: 0, Errors: 0, Skipped: 0, Time elapsed: 1.195 sec - in org.apache.hadoop.hdfs.qjournal.client.TestQuorumJournalManagerUnit
Running org.apache.hadoop.hdfs.qjournal.client.TestSegmentRecoveryComparator
Tests run: 1, Failures: 0, Errors: 0, Skipped: 0, Time elapsed: 0.245 sec - in org.apache.hadoop.hdfs.qjournal.client.TestSegmentRecoveryComparator
Running org.apache.hadoop.hdfs.qjournal.client.TestQuorumCall
Tests run: 1, Failures: 0, Errors: 0, Skipped: 0, Time elapsed: 0.227 sec - in org.apache.hadoop.hdfs.qjournal.client.TestQuorumCall
Running org.apache.hadoop.hdfs.qjournal.client.TestQuorumJournalManager
Tests run: 21, Failures: 0, Errors: 0, Skipped: 0, Time elapsed: 20.519 sec - in org.apache.hadoop.hdfs.qjournal.client.TestQuorumJournalManager
Running org.apache.hadoop.hdfs.qjournal.TestMiniJournalCluster
Tests run: 1, Failures: 0, Errors: 0, Skipped: 0, Time elapsed: 1.456 sec - in org.apache.hadoop.hdfs.qjournal.TestMiniJournalCluster
Running org.apache.hadoop.hdfs.TestFileCreationEmpty
Tests run: 1, Failures: 0, Errors: 0, Skipped: 0, Time elapsed: 8.706 sec - in org.apache.hadoop.hdfs.TestFileCreationEmpty
Running org.apache.hadoop.hdfs.TestBlockMissingException
Tests run: 1, Failures: 0, Errors: 0, Skipped: 0, Time elapsed: 4.031 sec - in org.apache.hadoop.hdfs.TestBlockMissingException
Running org.apache.hadoop.hdfs.TestDataTransferKeepalive
Tests run: 4, Failures: 0, Errors: 0, Skipped: 0, Time elapsed: 15.437 sec - in org.apache.hadoop.hdfs.TestDataTransferKeepalive
Running org.apache.hadoop.hdfs.TestModTime
Tests run: 2, Failures: 0, Errors: 0, Skipped: 0, Time elapsed: 12.002 sec - in org.apache.hadoop.hdfs.TestModTime
Running org.apache.hadoop.hdfs.TestRollingUpgradeDowngrade
Tests run: 2, Failures: 0, Errors: 0, Skipped: 0, Time elapsed: 8.361 sec - in org.apache.hadoop.hdfs.TestRollingUpgradeDowngrade
Running org.apache.hadoop.hdfs.TestLease
Tests run: 5, Failures: 0, Errors: 0, Skipped: 0, Time elapsed: 9.15 sec - in org.apache.hadoop.hdfs.TestLease
Running org.apache.hadoop.hdfs.TestParallelUnixDomainRead
Tests run: 4, Failures: 0, Errors: 0, Skipped: 0, Time elapsed: 33.762 sec - in org.apache.hadoop.hdfs.TestParallelUnixDomainRead
Running org.apache.hadoop.hdfs.TestDeprecatedKeys
Tests run: 1, Failures: 0, Errors: 0, Skipped: 0, Time elapsed: 0.422 sec - in org.apache.hadoop.hdfs.TestDeprecatedKeys
Running org.apache.hadoop.hdfs.TestFSOutputSummer
Tests run: 2, Failures: 0, Errors: 0, Skipped: 0, Time elapsed: 7.466 sec - in org.apache.hadoop.hdfs.TestFSOutputSummer
Running org.apache.hadoop.hdfs.TestRead
Tests run: 3, Failures: 0, Errors: 0, Skipped: 0, Time elapsed: 5.546 sec - in org.apache.hadoop.hdfs.TestRead
Running org.apache.hadoop.hdfs.TestDFSInotifyEventInputStream
Tests run: 5, Failures: 0, Errors: 0, Skipped: 0, Time elapsed: 18.022 sec - in org.apache.hadoop.hdfs.TestDFSInotifyEventInputStream
Running org.apache.hadoop.hdfs.TestCrcCorruption
Tests run: 4, Failures: 0, Errors: 0, Skipped: 0, Time elapsed: 14.135 sec - in org.apache.hadoop.hdfs.TestCrcCorruption
Running org.apache.hadoop.hdfs.TestGetBlocks
Tests run: 3, Failures: 0, Errors: 0, Skipped: 0, Time elapsed: 49.979 sec - in org.apache.hadoop.hdfs.TestGetBlocks
Running org.apache.hadoop.hdfs.TestDataTransferProtocol
Tests run: 3, Failures: 0, Errors: 0, Skipped: 0, Time elapsed: 5.264 sec - in org.apache.hadoop.hdfs.TestDataTransferProtocol
Running org.apache.hadoop.hdfs.TestReadWhileWriting
Tests run: 1, Failures: 0, Errors: 0, Skipped: 0, Time elapsed: 6.339 sec - in org.apache.hadoop.hdfs.TestReadWhileWriting
Running org.apache.hadoop.net.TestNetworkTopology
Tests run: 10, Failures: 0, Errors: 0, Skipped: 0, Time elapsed: 8.573 sec - in org.apache.hadoop.net.TestNetworkTopology
Running org.apache.hadoop.tracing.TestTraceAdmin
Tests run: 1, Failures: 0, Errors: 0, Skipped: 0, Time elapsed: 3.866 sec - in org.apache.hadoop.tracing.TestTraceAdmin
Running org.apache.hadoop.tracing.TestTracingShortCircuitLocalRead
Tests run: 1, Failures: 0, Errors: 0, Skipped: 0, Time elapsed: 3.989 sec - in org.apache.hadoop.tracing.TestTracingShortCircuitLocalRead
Running org.apache.hadoop.tracing.TestTracing
Tests run: 5, Failures: 0, Errors: 0, Skipped: 0, Time elapsed: 4.483 sec - in org.apache.hadoop.tracing.TestTracing
Running org.apache.hadoop.TestRefreshCallQueue
Tests run: 1, Failures: 0, Errors: 0, Skipped: 0, Time elapsed: 3.549 sec - in org.apache.hadoop.TestRefreshCallQueue

Results :

Tests in error: 
  TestRenameWithSnapshots.testRename2PreDescendant_3 » OutOfMemory GC overhead l...
  TestRenameWithSnapshots.testRenameFromNonSDir2SDir » OutOfMemory GC overhead l...
  TestRenameWithSnapshots.testRenameFileAndDeleteSnapshot » OutOfMemory Java hea...
  TestRenameWithSnapshots.testCleanDstReference » OutOfMemory Java heap space
  TestRenameWithSnapshots.testRenameDirAcrossSnapshottableDirs » OutOfMemory GC ...
  TestRenameWithSnapshots.testRenameUndo_1 » OutOfMemory Java heap space
  TestRenameWithSnapshots.testRenameUndo_2 » OutOfMemory GC overhead limit excee...
  TestRenameWithSnapshots.testRenameUndo_3 » OutOfMemory Java heap space
  TestRenameWithSnapshots.testRenameUndo_4 » OutOfMemory Java heap space
  TestRenameWithSnapshots.testRenameUndo_5 » OutOfMemory GC overhead limit excee...
  TestRenameWithSnapshots.testRenameUndo_6 » OutOfMemory Java heap space
  TestRenameWithSnapshots.testRenameUndo_7 » OutOfMemory GC overhead limit excee...
  TestRenameWithSnapshots.testRenameUCFileInSnapshot » OutOfMemory Java heap spa...
  TestRenameWithSnapshots.testRenameAndUpdateSnapshottableDirs » OutOfMemory Jav...
  TestRenameWithSnapshots.testRenameMoreThanOnceAcrossSnapDirs_2 » OutOfMemory G...
  TestRenameWithSnapshots.testRenameWithOverWrite » OutOfMemory Java heap space
  TestRenameWithSnapshots.testRenameMoreThanOnceAcrossSnapDirs » OutOfMemory GC ...
  TestRenameWithSnapshots.testRenameFromSDir2NonSDir » OutOfMemory Java heap spa...
  TestRenameWithSnapshots.testRename2PreDescendant » OutOfMemory Java heap space
  TestRenameWithSnapshots.testRenameFileInSnapshot » OutOfMemory GC overhead lim...

Tests run: 3187, Failures: 0, Errors: 20, Skipped: 17

[INFO]                                                                         
[INFO] ------------------------------------------------------------------------
[INFO] Skipping Apache Hadoop HttpFS
[INFO] This project has been banned from the build due to previous failures.
[INFO] ------------------------------------------------------------------------
[INFO]                                                                         
[INFO] ------------------------------------------------------------------------
[INFO] Skipping Apache Hadoop HDFS BookKeeper Journal
[INFO] This project has been banned from the build due to previous failures.
[INFO] ------------------------------------------------------------------------
[INFO]                                                                         
[INFO] ------------------------------------------------------------------------
[INFO] Skipping Apache Hadoop HDFS-NFS
[INFO] This project has been banned from the build due to previous failures.
[INFO] ------------------------------------------------------------------------
[INFO]                                                                         
[INFO] ------------------------------------------------------------------------
[INFO] Building Apache Hadoop HDFS Project 3.0.0-SNAPSHOT
[INFO] ------------------------------------------------------------------------
[WARNING] The POM for org.eclipse.m2e:lifecycle-mapping:jar:1.0.0 is missing, no dependency
information available
[WARNING] Failed to retrieve plugin descriptor for org.eclipse.m2e:lifecycle-mapping:1.0.0:
Plugin org.eclipse.m2e:lifecycle-mapping:1.0.0 or one of its dependencies could not be resolved:
Failure to find org.eclipse.m2e:lifecycle-mapping:jar:1.0.0 in http://repo.maven.apache.org/maven2
was cached in the local repository, resolution will not be reattempted until the update interval
of central has elapsed or updates are forced
[INFO] 
[INFO] --- maven-clean-plugin:2.4.1:clean (default-clean) @ hadoop-hdfs-project ---
[INFO] Deleting <https://builds.apache.org/job/Hadoop-Hdfs-trunk-Java8/ws/hadoop-hdfs-project/target>
[INFO] 
[INFO] --- maven-antrun-plugin:1.7:run (create-testdirs) @ hadoop-hdfs-project ---
[INFO] Executing tasks

main:
    [mkdir] Created dir: <https://builds.apache.org/job/Hadoop-Hdfs-trunk-Java8/ws/hadoop-hdfs-project/target/test-dir>
[INFO] Executed tasks
[INFO] 
[INFO] --- maven-source-plugin:2.1.2:jar-no-fork (hadoop-java-sources) @ hadoop-hdfs-project
---
[INFO] 
[INFO] --- maven-source-plugin:2.1.2:test-jar-no-fork (hadoop-java-sources) @ hadoop-hdfs-project
---
[INFO] 
[INFO] --- maven-enforcer-plugin:1.3.1:enforce (dist-enforce) @ hadoop-hdfs-project ---
[INFO] 
[INFO] --- maven-site-plugin:3.3:attach-descriptor (attach-descriptor) @ hadoop-hdfs-project
---
[INFO] 
[INFO] --- maven-javadoc-plugin:2.8.1:jar (module-javadocs) @ hadoop-hdfs-project ---
[INFO] Not executing Javadoc as the project is not a Java classpath-capable package
[INFO] 
[INFO] --- maven-enforcer-plugin:1.3.1:enforce (depcheck) @ hadoop-hdfs-project ---
[INFO] 
[INFO] --- maven-checkstyle-plugin:2.6:checkstyle (default-cli) @ hadoop-hdfs-project ---
[INFO] 
[INFO] --- findbugs-maven-plugin:2.3.2:findbugs (default-cli) @ hadoop-hdfs-project ---
[INFO] ****** FindBugsMojo execute *******
[INFO] canGenerate is false
[INFO] ------------------------------------------------------------------------
[INFO] Reactor Summary:
[INFO] 
[INFO] Apache Hadoop HDFS ................................ FAILURE [  02:32 h]
[INFO] Apache Hadoop HttpFS .............................. SKIPPED
[INFO] Apache Hadoop HDFS BookKeeper Journal ............. SKIPPED
[INFO] Apache Hadoop HDFS-NFS ............................ SKIPPED
[INFO] Apache Hadoop HDFS Project ........................ SUCCESS [  1.678 s]
[INFO] ------------------------------------------------------------------------
[INFO] BUILD FAILURE
[INFO] ------------------------------------------------------------------------
[INFO] Total time: 02:32 h
[INFO] Finished at: 2014-12-08T00:49:07+00:00
[INFO] Final Memory: 53M/256M
[INFO] ------------------------------------------------------------------------
[ERROR] Failed to execute goal org.apache.maven.plugins:maven-surefire-plugin:2.16:test (default-test)
on project hadoop-hdfs: There are test failures.
[ERROR] 
[ERROR] Please refer to <https://builds.apache.org/job/Hadoop-Hdfs-trunk-Java8/ws/hadoop-hdfs-project/hadoop-hdfs/target/surefire-reports>
for the individual test results.
[ERROR] -> [Help 1]
[ERROR] 
[ERROR] To see the full stack trace of the errors, re-run Maven with the -e switch.
[ERROR] Re-run Maven using the -X switch to enable full debug logging.
[ERROR] 
[ERROR] For more information about the errors and possible solutions, please read the following
articles:
[ERROR] [Help 1] http://cwiki.apache.org/confluence/display/MAVEN/MojoFailureException
Build step 'Execute shell' marked build as failure
Archiving artifacts
Recording test results

Mime
View raw message