hadoop-hdfs-dev mailing list archives

Site index · List index
Message view « Date » · « Thread »
Top « Date » · « Thread »
From Apache Jenkins Server <jenk...@builds.apache.org>
Subject Hadoop-Hdfs-trunk-Java8 - Build # 17 - Failure
Date Wed, 26 Nov 2014 14:31:30 GMT
See https://builds.apache.org/job/Hadoop-Hdfs-trunk-Java8/17/

###################################################################################
########################## LAST 60 LINES OF THE CONSOLE ###########################
[...truncated 11461 lines...]
[INFO] Not executing Javadoc as the project is not a Java classpath-capable package
[INFO] 
[INFO] --- maven-enforcer-plugin:1.3.1:enforce (depcheck) @ hadoop-hdfs-project ---
[INFO] 
[INFO] --- maven-checkstyle-plugin:2.6:checkstyle (default-cli) @ hadoop-hdfs-project ---
[INFO] 
[INFO] --- findbugs-maven-plugin:2.3.2:findbugs (default-cli) @ hadoop-hdfs-project ---
[INFO] ****** FindBugsMojo execute *******
[INFO] canGenerate is false
[INFO] ------------------------------------------------------------------------
[INFO] Reactor Summary:
[INFO] 
[INFO] Apache Hadoop HDFS ................................ SUCCESS [  02:48 h]
[INFO] Apache Hadoop HttpFS .............................. SUCCESS [03:35 min]
[INFO] Apache Hadoop HDFS BookKeeper Journal ............. FAILURE [01:54 min]
[INFO] Apache Hadoop HDFS-NFS ............................ SUCCESS [01:31 min]
[INFO] Apache Hadoop HDFS Project ........................ SUCCESS [  0.039 s]
[INFO] ------------------------------------------------------------------------
[INFO] BUILD FAILURE
[INFO] ------------------------------------------------------------------------
[INFO] Total time: 02:55 h
[INFO] Finished at: 2014-11-26T14:29:36+00:00
[INFO] Final Memory: 102M/1495M
[INFO] ------------------------------------------------------------------------
[ERROR] Failed to execute goal org.apache.maven.plugins:maven-surefire-plugin:2.16:test (default-test)
on project hadoop-hdfs-bkjournal: There are test failures.
[ERROR] 
[ERROR] Please refer to /home/jenkins/jenkins-slave/workspace/Hadoop-Hdfs-trunk-Java8/hadoop-hdfs-project/hadoop-hdfs/src/contrib/bkjournal/target/surefire-reports
for the individual test results.
[ERROR] -> [Help 1]
[ERROR] 
[ERROR] To see the full stack trace of the errors, re-run Maven with the -e switch.
[ERROR] Re-run Maven using the -X switch to enable full debug logging.
[ERROR] 
[ERROR] For more information about the errors and possible solutions, please read the following
articles:
[ERROR] [Help 1] http://cwiki.apache.org/confluence/display/MAVEN/MojoFailureException
[ERROR] 
[ERROR] After correcting the problems, you can resume the build with the command
[ERROR]   mvn <goals> -rf :hadoop-hdfs-bkjournal
Build step 'Execute shell' marked build as failure
Archiving artifacts
Sending artifact delta relative to Hadoop-Hdfs-trunk-Java8 #16
Archived 2 artifacts
Archive block size is 32768
Received 99 blocks and 125673432 bytes
Compression is 2.5%
Took 59 sec
Recording test results
Updating MAPREDUCE-5568
Updating YARN-1492
Updating YARN-2188
Updating HADOOP-11173
Updating YARN-2906
Updating YARN-2404
Updating MAPREDUCE-5785
Updating HDFS-7097
Updating HADOOP-11300
Updating HDFS-7440
Sending e-mails to: hdfs-dev@hadoop.apache.org
Email was triggered for: Failure
Sending email for trigger: Failure



###################################################################################
############################## FAILED TESTS (if any) ##############################
All tests passed
Mime
  • Unnamed multipart/mixed (inline, None, 0 bytes)
View raw message