hadoop-hdfs-dev mailing list archives

Site index · List index
Message view « Date » · « Thread »
Top « Date » · « Thread »
From Apache Jenkins Server <jenk...@builds.apache.org>
Subject Hadoop-Hdfs-trunk-Java8 - Build # 10 - Still Failing
Date Wed, 19 Nov 2014 14:06:52 GMT
See https://builds.apache.org/job/Hadoop-Hdfs-trunk-Java8/10/

###################################################################################
########################## LAST 60 LINES OF THE CONSOLE ###########################
[...truncated 7640 lines...]
[INFO] --- maven-source-plugin:2.1.2:jar-no-fork (hadoop-java-sources) @ hadoop-hdfs-project
---
[INFO] 
[INFO] --- maven-source-plugin:2.1.2:test-jar-no-fork (hadoop-java-sources) @ hadoop-hdfs-project
---
[INFO] 
[INFO] --- maven-enforcer-plugin:1.3.1:enforce (dist-enforce) @ hadoop-hdfs-project ---
[INFO] 
[INFO] --- maven-site-plugin:3.3:attach-descriptor (attach-descriptor) @ hadoop-hdfs-project
---
[INFO] 
[INFO] --- maven-javadoc-plugin:2.8.1:jar (module-javadocs) @ hadoop-hdfs-project ---
[INFO] Not executing Javadoc as the project is not a Java classpath-capable package
[INFO] 
[INFO] --- maven-enforcer-plugin:1.3.1:enforce (depcheck) @ hadoop-hdfs-project ---
[INFO] 
[INFO] --- maven-checkstyle-plugin:2.6:checkstyle (default-cli) @ hadoop-hdfs-project ---
[INFO] 
[INFO] --- findbugs-maven-plugin:2.3.2:findbugs (default-cli) @ hadoop-hdfs-project ---
[INFO] ****** FindBugsMojo execute *******
[INFO] canGenerate is false
[INFO] ------------------------------------------------------------------------
[INFO] Reactor Summary:
[INFO] 
[INFO] Apache Hadoop HDFS ................................ FAILURE [  02:30 h]
[INFO] Apache Hadoop HttpFS .............................. SKIPPED
[INFO] Apache Hadoop HDFS BookKeeper Journal ............. SKIPPED
[INFO] Apache Hadoop HDFS-NFS ............................ SKIPPED
[INFO] Apache Hadoop HDFS Project ........................ SUCCESS [  2.226 s]
[INFO] ------------------------------------------------------------------------
[INFO] BUILD FAILURE
[INFO] ------------------------------------------------------------------------
[INFO] Total time: 02:30 h
[INFO] Finished at: 2014-11-19T14:05:21+00:00
[INFO] Final Memory: 62M/827M
[INFO] ------------------------------------------------------------------------
[ERROR] Failed to execute goal org.apache.maven.plugins:maven-surefire-plugin:2.16:test (default-test)
on project hadoop-hdfs: There are test failures.
[ERROR] 
[ERROR] Please refer to /home/jenkins/jenkins-slave/workspace/Hadoop-Hdfs-trunk-Java8/hadoop-hdfs-project/hadoop-hdfs/target/surefire-reports
for the individual test results.
[ERROR] -> [Help 1]
[ERROR] 
[ERROR] To see the full stack trace of the errors, re-run Maven with the -e switch.
[ERROR] Re-run Maven using the -X switch to enable full debug logging.
[ERROR] 
[ERROR] For more information about the errors and possible solutions, please read the following
articles:
[ERROR] [Help 1] http://cwiki.apache.org/confluence/display/MAVEN/MojoFailureException
Build step 'Execute shell' marked build as failure
Archiving artifacts
Recording test results
Updating YARN-2870
Updating HDFS-7225
Updating HADOOP-11309
Updating YARN-2157
Updating HADOOP-11201
Updating MAPREDUCE-6049
Updating HDFS-7373
Updating HDFS-7406
Updating HADOOP-11312
Updating HDFS-7398
Sending e-mails to: hdfs-dev@hadoop.apache.org
Email was triggered for: Failure
Sending email for trigger: Failure



###################################################################################
############################## FAILED TESTS (if any) ##############################
2 tests failed.
REGRESSION:  org.apache.hadoop.hdfs.server.namenode.ha.TestPipelinesFailover.testWriteOverGracefulFailoverWithDnFail

Error Message:
test timed out after 30000 milliseconds

Stack Trace:
java.lang.Exception: test timed out after 30000 milliseconds
	at java.net.Inet4AddressImpl.lookupAllHostAddr(Native Method)
	at java.net.InetAddress$1.lookupAllHostAddr(InetAddress.java:876)
	at java.net.InetAddress.getAddressFromNameService(InetAddress.java:1229)
	at java.net.InetAddress.getAllByName0(InetAddress.java:1180)
	at java.net.InetAddress.getAllByName(InetAddress.java:1110)
	at java.net.InetAddress.getAllByName(InetAddress.java:1046)
	at java.net.InetAddress.getByName(InetAddress.java:996)
	at org.apache.hadoop.security.SecurityUtil$StandardHostResolver.getByName(SecurityUtil.java:477)
	at org.apache.hadoop.security.SecurityUtil.getByName(SecurityUtil.java:464)
	at org.apache.hadoop.net.NetUtils.createSocketAddrForHost(NetUtils.java:236)
	at org.apache.hadoop.net.NetUtils.createSocketAddr(NetUtils.java:216)
	at org.apache.hadoop.net.NetUtils.createSocketAddr(NetUtils.java:164)
	at org.apache.hadoop.hdfs.server.namenode.NameNode.getAddress(NameNode.java:383)
	at org.apache.hadoop.hdfs.server.namenode.NameNode.getAddress(NameNode.java:435)
	at org.apache.hadoop.hdfs.NameNodeProxies.createProxy(NameNodeProxies.java:197)
	at org.apache.hadoop.hdfs.DFSClient.<init>(DFSClient.java:673)
	at org.apache.hadoop.hdfs.DFSClient.<init>(DFSClient.java:607)
	at org.apache.hadoop.hdfs.DistributedFileSystem.initialize(DistributedFileSystem.java:148)
	at org.apache.hadoop.fs.FileSystem.createFileSystem(FileSystem.java:2625)
	at org.apache.hadoop.fs.FileSystem.access$200(FileSystem.java:91)
	at org.apache.hadoop.fs.FileSystem$Cache.getInternal(FileSystem.java:2659)
	at org.apache.hadoop.fs.FileSystem$Cache.get(FileSystem.java:2641)
	at org.apache.hadoop.fs.FileSystem.get(FileSystem.java:370)
	at org.apache.hadoop.hdfs.server.namenode.ha.HATestUtil.configureFailoverFs(HATestUtil.java:151)
	at org.apache.hadoop.hdfs.server.namenode.ha.HATestUtil.configureFailoverFs(HATestUtil.java:136)
	at org.apache.hadoop.hdfs.server.namenode.ha.TestPipelinesFailover.doTestWriteOverFailoverWithDnFail(TestPipelinesFailover.java:232)
	at org.apache.hadoop.hdfs.server.namenode.ha.TestPipelinesFailover.testWriteOverGracefulFailoverWithDnFail(TestPipelinesFailover.java:207)


REGRESSION:  org.apache.hadoop.hdfs.server.namenode.ha.TestPipelinesFailover.testWriteOverCrashFailoverWithDnFail

Error Message:
Test resulted in an unexpected exit

Stack Trace:
java.lang.AssertionError: Test resulted in an unexpected exit
	at org.apache.hadoop.hdfs.MiniDFSCluster.shutdown(MiniDFSCluster.java:1709)
	at org.apache.hadoop.hdfs.MiniDFSCluster.shutdown(MiniDFSCluster.java:1696)
	at org.apache.hadoop.hdfs.server.namenode.ha.TestPipelinesFailover.doTestWriteOverFailoverWithDnFail(TestPipelinesFailover.java:268)
	at org.apache.hadoop.hdfs.server.namenode.ha.TestPipelinesFailover.testWriteOverCrashFailoverWithDnFail(TestPipelinesFailover.java:212)



Mime
  • Unnamed multipart/mixed (inline, None, 0 bytes)
View raw message