hadoop-hdfs-dev mailing list archives

Site index · List index
Message view « Date » · « Thread »
Top « Date » · « Thread »
From Apache Jenkins Server <jenk...@builds.apache.org>
Subject Hadoop-Hdfs-trunk - Build # 1942 - Failure
Date Sun, 23 Nov 2014 14:03:16 GMT
See https://builds.apache.org/job/Hadoop-Hdfs-trunk/1942/

###################################################################################
########################## LAST 60 LINES OF THE CONSOLE ###########################
[...truncated 6235 lines...]
[INFO] --- maven-clean-plugin:2.4.1:clean (default-clean) @ hadoop-hdfs-project ---
[INFO] Deleting /home/jenkins/jenkins-slave/workspace/Hadoop-Hdfs-trunk/hadoop-hdfs-project/target
[INFO] 
[INFO] --- maven-antrun-plugin:1.7:run (create-testdirs) @ hadoop-hdfs-project ---
[INFO] Executing tasks

main:
    [mkdir] Created dir: /home/jenkins/jenkins-slave/workspace/Hadoop-Hdfs-trunk/hadoop-hdfs-project/target/test-dir
[INFO] Executed tasks
[INFO] 
[INFO] --- maven-source-plugin:2.1.2:jar-no-fork (hadoop-java-sources) @ hadoop-hdfs-project
---
[INFO] 
[INFO] --- maven-source-plugin:2.1.2:test-jar-no-fork (hadoop-java-sources) @ hadoop-hdfs-project
---
[INFO] 
[INFO] --- maven-enforcer-plugin:1.3.1:enforce (dist-enforce) @ hadoop-hdfs-project ---
[INFO] 
[INFO] --- maven-site-plugin:3.3:attach-descriptor (attach-descriptor) @ hadoop-hdfs-project
---
[INFO] 
[INFO] --- maven-javadoc-plugin:2.8.1:jar (module-javadocs) @ hadoop-hdfs-project ---
[INFO] Not executing Javadoc as the project is not a Java classpath-capable package
[INFO] 
[INFO] --- maven-enforcer-plugin:1.3.1:enforce (depcheck) @ hadoop-hdfs-project ---
[INFO] 
[INFO] --- maven-checkstyle-plugin:2.6:checkstyle (default-cli) @ hadoop-hdfs-project ---
[INFO] 
[INFO] --- findbugs-maven-plugin:2.3.2:findbugs (default-cli) @ hadoop-hdfs-project ---
[INFO] ****** FindBugsMojo execute *******
[INFO] canGenerate is false
[INFO] ------------------------------------------------------------------------
[INFO] Reactor Summary:
[INFO] 
[INFO] Apache Hadoop HDFS ................................ FAILURE [  02:28 h]
[INFO] Apache Hadoop HttpFS .............................. SKIPPED
[INFO] Apache Hadoop HDFS BookKeeper Journal ............. SKIPPED
[INFO] Apache Hadoop HDFS-NFS ............................ SKIPPED
[INFO] Apache Hadoop HDFS Project ........................ SUCCESS [  2.172 s]
[INFO] ------------------------------------------------------------------------
[INFO] BUILD FAILURE
[INFO] ------------------------------------------------------------------------
[INFO] Total time: 02:28 h
[INFO] Finished at: 2014-11-23T14:02:35+00:00
[INFO] Final Memory: 64M/851M
[INFO] ------------------------------------------------------------------------
[ERROR] Failed to execute goal org.apache.maven.plugins:maven-surefire-plugin:2.16:test (default-test)
on project hadoop-hdfs: There are test failures.
[ERROR] 
[ERROR] Please refer to /home/jenkins/jenkins-slave/workspace/Hadoop-Hdfs-trunk/hadoop-hdfs-project/hadoop-hdfs/target/surefire-reports
for the individual test results.
[ERROR] -> [Help 1]
[ERROR] 
[ERROR] To see the full stack trace of the errors, re-run Maven with the -e switch.
[ERROR] Re-run Maven using the -X switch to enable full debug logging.
[ERROR] 
[ERROR] For more information about the errors and possible solutions, please read the following
articles:
[ERROR] [Help 1] http://cwiki.apache.org/confluence/display/MAVEN/MojoFailureException
Build step 'Execute shell' marked build as failure
Archiving artifacts
Recording test results
Sending e-mails to: hdfs-dev@hadoop.apache.org
Email was triggered for: Failure
Sending email for trigger: Failure



###################################################################################
############################## FAILED TESTS (if any) ##############################
2 tests failed.
REGRESSION:  org.apache.hadoop.hdfs.TestEncryptionZonesWithKMS.testReadWriteUsingWebHdfs

Error Message:
Stream closed.

Stack Trace:
java.io.IOException: Stream closed.
	at sun.reflect.GeneratedConstructorAccessor58.newInstance(Unknown Source)
	at sun.reflect.DelegatingConstructorAccessorImpl.newInstance(DelegatingConstructorAccessorImpl.java:27)
	at java.lang.reflect.Constructor.newInstance(Constructor.java:513)
	at org.apache.hadoop.ipc.RemoteException.instantiateException(RemoteException.java:106)
	at org.apache.hadoop.ipc.RemoteException.unwrapRemoteException(RemoteException.java:95)
	at org.apache.hadoop.hdfs.web.WebHdfsFileSystem.toIOException(WebHdfsFileSystem.java:385)
	at org.apache.hadoop.hdfs.web.WebHdfsFileSystem.access$600(WebHdfsFileSystem.java:91)
	at org.apache.hadoop.hdfs.web.WebHdfsFileSystem$AbstractRunner.shouldRetry(WebHdfsFileSystem.java:656)
	at org.apache.hadoop.hdfs.web.WebHdfsFileSystem$AbstractRunner.runWithRetry(WebHdfsFileSystem.java:622)
	at org.apache.hadoop.hdfs.web.WebHdfsFileSystem$AbstractRunner.access$100(WebHdfsFileSystem.java:458)
	at org.apache.hadoop.hdfs.web.WebHdfsFileSystem$AbstractRunner$1.run(WebHdfsFileSystem.java:487)
	at java.security.AccessController.doPrivileged(Native Method)
	at javax.security.auth.Subject.doAs(Subject.java:396)
	at org.apache.hadoop.security.UserGroupInformation.doAs(UserGroupInformation.java:1683)
	at org.apache.hadoop.hdfs.web.WebHdfsFileSystem$AbstractRunner.run(WebHdfsFileSystem.java:483)
	at org.apache.hadoop.hdfs.web.WebHdfsFileSystem$UnresolvedUrlOpener.connect(WebHdfsFileSystem.java:1204)
	at org.apache.hadoop.hdfs.web.ByteRangeInputStream.openInputStream(ByteRangeInputStream.java:120)
	at org.apache.hadoop.hdfs.web.ByteRangeInputStream.getInputStream(ByteRangeInputStream.java:104)
	at org.apache.hadoop.hdfs.web.ByteRangeInputStream.<init>(ByteRangeInputStream.java:89)
	at org.apache.hadoop.hdfs.web.WebHdfsFileSystem$OffsetUrlInputStream.<init>(WebHdfsFileSystem.java:1261)
	at org.apache.hadoop.hdfs.web.WebHdfsFileSystem.open(WebHdfsFileSystem.java:1175)
	at org.apache.hadoop.fs.FileSystem.open(FileSystem.java:766)
	at org.apache.hadoop.hdfs.DFSTestUtil.verifyFilesEqual(DFSTestUtil.java:1399)
	at org.apache.hadoop.hdfs.TestEncryptionZones.testReadWriteUsingWebHdfs(TestEncryptionZones.java:634)
	at sun.reflect.NativeMethodAccessorImpl.invoke0(Native Method)
	at sun.reflect.NativeMethodAccessorImpl.invoke(NativeMethodAccessorImpl.java:39)
	at sun.reflect.DelegatingMethodAccessorImpl.invoke(DelegatingMethodAccessorImpl.java:25)
	at java.lang.reflect.Method.invoke(Method.java:597)
	at org.junit.runners.model.FrameworkMethod$1.runReflectiveCall(FrameworkMethod.java:47)
	at org.junit.internal.runners.model.ReflectiveCallable.run(ReflectiveCallable.java:12)
	at org.junit.runners.model.FrameworkMethod.invokeExplosively(FrameworkMethod.java:44)
	at org.junit.internal.runners.statements.InvokeMethod.evaluate(InvokeMethod.java:17)
	at org.junit.internal.runners.statements.FailOnTimeout$StatementThread.run(FailOnTimeout.java:74)
Caused by: org.apache.hadoop.ipc.RemoteException: Stream closed.
	at org.apache.hadoop.hdfs.web.JsonUtil.toRemoteException(JsonUtil.java:165)
	at org.apache.hadoop.hdfs.web.WebHdfsFileSystem.validateResponse(WebHdfsFileSystem.java:353)
	at org.apache.hadoop.hdfs.web.WebHdfsFileSystem.access$200(WebHdfsFileSystem.java:91)
	at org.apache.hadoop.hdfs.web.WebHdfsFileSystem$AbstractRunner.runWithRetry(WebHdfsFileSystem.java:608)
	at org.apache.hadoop.hdfs.web.WebHdfsFileSystem$AbstractRunner.access$100(WebHdfsFileSystem.java:458)
	at org.apache.hadoop.hdfs.web.WebHdfsFileSystem$AbstractRunner$1.run(WebHdfsFileSystem.java:487)
	at java.security.AccessController.doPrivileged(Native Method)
	at javax.security.auth.Subject.doAs(Subject.java:396)
	at org.apache.hadoop.security.UserGroupInformation.doAs(UserGroupInformation.java:1683)
	at org.apache.hadoop.hdfs.web.WebHdfsFileSystem$AbstractRunner.run(WebHdfsFileSystem.java:483)
	at org.apache.hadoop.hdfs.web.WebHdfsFileSystem$UnresolvedUrlOpener.connect(WebHdfsFileSystem.java:1204)
	at org.apache.hadoop.hdfs.web.ByteRangeInputStream.openInputStream(ByteRangeInputStream.java:120)
	at org.apache.hadoop.hdfs.web.ByteRangeInputStream.getInputStream(ByteRangeInputStream.java:104)
	at org.apache.hadoop.hdfs.web.ByteRangeInputStream.<init>(ByteRangeInputStream.java:89)
	at org.apache.hadoop.hdfs.web.WebHdfsFileSystem$OffsetUrlInputStream.<init>(WebHdfsFileSystem.java:1261)
	at org.apache.hadoop.hdfs.web.WebHdfsFileSystem.open(WebHdfsFileSystem.java:1175)
	at org.apache.hadoop.fs.FileSystem.open(FileSystem.java:766)
	at org.apache.hadoop.hdfs.DFSTestUtil.verifyFilesEqual(DFSTestUtil.java:1399)
	at org.apache.hadoop.hdfs.TestEncryptionZones.testReadWriteUsingWebHdfs(TestEncryptionZones.java:634)
	at sun.reflect.NativeMethodAccessorImpl.invoke0(Native Method)
	at sun.reflect.NativeMethodAccessorImpl.invoke(NativeMethodAccessorImpl.java:39)
	at sun.reflect.DelegatingMethodAccessorImpl.invoke(DelegatingMethodAccessorImpl.java:25)
	at java.lang.reflect.Method.invoke(Method.java:597)
	at org.junit.runners.model.FrameworkMethod$1.runReflectiveCall(FrameworkMethod.java:47)
	at org.junit.internal.runners.model.ReflectiveCallable.run(ReflectiveCallable.java:12)
	at org.junit.runners.model.FrameworkMethod.invokeExplosively(FrameworkMethod.java:44)
	at org.junit.internal.runners.statements.InvokeMethod.evaluate(InvokeMethod.java:17)
	at org.junit.internal.runners.statements.FailOnTimeout$StatementThread.run(FailOnTimeout.java:74)


REGRESSION:  org.apache.hadoop.hdfs.server.balancer.TestBalancer.testUnknownDatanode

Error Message:
expected:<0> but was:<-3>

Stack Trace:
java.lang.AssertionError: expected:<0> but was:<-3>
	at org.junit.Assert.fail(Assert.java:88)
	at org.junit.Assert.failNotEquals(Assert.java:743)
	at org.junit.Assert.assertEquals(Assert.java:118)
	at org.junit.Assert.assertEquals(Assert.java:555)
	at org.junit.Assert.assertEquals(Assert.java:542)
	at org.apache.hadoop.hdfs.server.balancer.TestBalancer.testUnknownDatanode(TestBalancer.java:806)



Mime
  • Unnamed multipart/mixed (inline, None, 0 bytes)
View raw message