hadoop-hdfs-dev mailing list archives

Site index · List index
Message view « Date » · « Thread »
Top « Date » · « Thread »
From Apache Jenkins Server <jenk...@builds.apache.org>
Subject Hadoop-Hdfs-trunk-Java8 - Build # 4 - Still Failing
Date Thu, 13 Nov 2014 13:59:43 GMT
See https://builds.apache.org/job/Hadoop-Hdfs-trunk-Java8/4/

###################################################################################
########################## LAST 60 LINES OF THE CONSOLE ###########################
[...truncated 6195 lines...]
[INFO] 
[INFO] --- maven-site-plugin:3.3:attach-descriptor (attach-descriptor) @ hadoop-hdfs-project
---
[INFO] 
[INFO] --- maven-javadoc-plugin:2.8.1:jar (module-javadocs) @ hadoop-hdfs-project ---
[INFO] Not executing Javadoc as the project is not a Java classpath-capable package
[INFO] 
[INFO] --- maven-enforcer-plugin:1.3.1:enforce (depcheck) @ hadoop-hdfs-project ---
[INFO] 
[INFO] --- maven-checkstyle-plugin:2.6:checkstyle (default-cli) @ hadoop-hdfs-project ---
[INFO] 
[INFO] --- findbugs-maven-plugin:2.3.2:findbugs (default-cli) @ hadoop-hdfs-project ---
[INFO] ****** FindBugsMojo execute *******
[INFO] canGenerate is false
[INFO] ------------------------------------------------------------------------
[INFO] Reactor Summary:
[INFO] 
[INFO] Apache Hadoop HDFS ................................ FAILURE [  02:24 h]
[INFO] Apache Hadoop HttpFS .............................. SKIPPED
[INFO] Apache Hadoop HDFS BookKeeper Journal ............. SKIPPED
[INFO] Apache Hadoop HDFS-NFS ............................ SKIPPED
[INFO] Apache Hadoop HDFS Project ........................ SUCCESS [  2.215 s]
[INFO] ------------------------------------------------------------------------
[INFO] BUILD FAILURE
[INFO] ------------------------------------------------------------------------
[INFO] Total time: 02:24 h
[INFO] Finished at: 2014-11-13T13:58:53+00:00
[INFO] Final Memory: 65M/845M
[INFO] ------------------------------------------------------------------------
[ERROR] Failed to execute goal org.apache.maven.plugins:maven-surefire-plugin:2.16:test (default-test)
on project hadoop-hdfs: There are test failures.
[ERROR] 
[ERROR] Please refer to /home/jenkins/jenkins-slave/workspace/Hadoop-Hdfs-trunk-Java8/hadoop-hdfs-project/hadoop-hdfs/target/surefire-reports
for the individual test results.
[ERROR] -> [Help 1]
[ERROR] 
[ERROR] To see the full stack trace of the errors, re-run Maven with the -e switch.
[ERROR] Re-run Maven using the -X switch to enable full debug logging.
[ERROR] 
[ERROR] For more information about the errors and possible solutions, please read the following
articles:
[ERROR] [Help 1] http://cwiki.apache.org/confluence/display/MAVEN/MojoFailureException
Build step 'Execute shell' marked build as failure
Archiving artifacts
Recording test results
Updating YARN-1492
Updating YARN-2794
Updating HADOOP-11284
Updating HDFS-7391
Updating HDFS-7387
Updating HADOOP-7984
Updating YARN-2780
Updating YARN-2603
Updating YARN-2236
Updating HADOOP-9576
Updating HADOOP-11291
Updating YARN-2843
Updating HADOOP-11025
Updating HADOOP-11217
Updating YARN-2841
Sending e-mails to: hdfs-dev@hadoop.apache.org
Email was triggered for: Failure
Sending email for trigger: Failure



###################################################################################
############################## FAILED TESTS (if any) ##############################
1 tests failed.
FAILED:  org.apache.hadoop.hdfs.TestDFSUpgradeFromImage.testUpgradeFromCorruptRel22Image

Error Message:
null

Stack Trace:
java.lang.IllegalStateException: null
	at com.google.common.base.Preconditions.checkState(Preconditions.java:129)
	at org.apache.hadoop.hdfs.server.blockmanagement.BlockIdManager.setGenerationStampV1Limit(BlockIdManager.java:85)
	at org.apache.hadoop.hdfs.server.blockmanagement.BlockIdManager.clear(BlockIdManager.java:206)
	at org.apache.hadoop.hdfs.server.namenode.FSNamesystem.clear(FSNamesystem.java:622)
	at org.apache.hadoop.hdfs.server.namenode.FSImage.loadFSImage(FSImage.java:667)
	at org.apache.hadoop.hdfs.server.namenode.FSImage.doUpgrade(FSImage.java:376)
	at org.apache.hadoop.hdfs.server.namenode.FSImage.recoverTransitionRead(FSImage.java:268)
	at org.apache.hadoop.hdfs.server.namenode.FSNamesystem.loadFSImage(FSNamesystem.java:991)
	at org.apache.hadoop.hdfs.server.namenode.FSNamesystem.loadFromDisk(FSNamesystem.java:714)
	at org.apache.hadoop.hdfs.server.namenode.NameNode.loadNamesystem(NameNode.java:537)
	at org.apache.hadoop.hdfs.server.namenode.NameNode.initialize(NameNode.java:596)
	at org.apache.hadoop.hdfs.server.namenode.NameNode.<init>(NameNode.java:763)
	at org.apache.hadoop.hdfs.server.namenode.NameNode.<init>(NameNode.java:747)
	at org.apache.hadoop.hdfs.server.namenode.NameNode.createNameNode(NameNode.java:1443)
	at org.apache.hadoop.hdfs.MiniDFSCluster.createNameNode(MiniDFSCluster.java:1104)
	at org.apache.hadoop.hdfs.MiniDFSCluster.createNameNodesAndSetConf(MiniDFSCluster.java:975)
	at org.apache.hadoop.hdfs.MiniDFSCluster.initMiniDFSCluster(MiniDFSCluster.java:804)
	at org.apache.hadoop.hdfs.MiniDFSCluster.<init>(MiniDFSCluster.java:465)
	at org.apache.hadoop.hdfs.MiniDFSCluster$Builder.build(MiniDFSCluster.java:424)
	at org.apache.hadoop.hdfs.TestDFSUpgradeFromImage.upgradeAndVerify(TestDFSUpgradeFromImage.java:582)
	at org.apache.hadoop.hdfs.TestDFSUpgradeFromImage.testUpgradeFromCorruptRel22Image(TestDFSUpgradeFromImage.java:318)



Mime
  • Unnamed multipart/mixed (inline, None, 0 bytes)
View raw message