hadoop-hdfs-dev mailing list archives

Site index · List index
Message view « Date » · « Thread »
Top « Date » · « Thread »
From Apache Jenkins Server <jenk...@builds.apache.org>
Subject Hadoop-Hdfs-trunk - Build # 1937 - Failure
Date Tue, 18 Nov 2014 14:14:40 GMT
See https://builds.apache.org/job/Hadoop-Hdfs-trunk/1937/

###################################################################################
########################## LAST 60 LINES OF THE CONSOLE ###########################
[...truncated 6841 lines...]
[INFO] Executed tasks
[INFO] 
[INFO] --- maven-source-plugin:2.1.2:jar-no-fork (hadoop-java-sources) @ hadoop-hdfs-project ---
[INFO] 
[INFO] --- maven-source-plugin:2.1.2:test-jar-no-fork (hadoop-java-sources) @ hadoop-hdfs-project ---
[INFO] 
[INFO] --- maven-enforcer-plugin:1.3.1:enforce (dist-enforce) @ hadoop-hdfs-project ---
[INFO] 
[INFO] --- maven-site-plugin:3.3:attach-descriptor (attach-descriptor) @ hadoop-hdfs-project ---
[INFO] 
[INFO] --- maven-javadoc-plugin:2.8.1:jar (module-javadocs) @ hadoop-hdfs-project ---
[INFO] Not executing Javadoc as the project is not a Java classpath-capable package
[INFO] 
[INFO] --- maven-enforcer-plugin:1.3.1:enforce (depcheck) @ hadoop-hdfs-project ---
[INFO] 
[INFO] --- maven-checkstyle-plugin:2.6:checkstyle (default-cli) @ hadoop-hdfs-project ---
[INFO] 
[INFO] --- findbugs-maven-plugin:2.3.2:findbugs (default-cli) @ hadoop-hdfs-project ---
[INFO] ****** FindBugsMojo execute *******
[INFO] canGenerate is false
[INFO] ------------------------------------------------------------------------
[INFO] Reactor Summary:
[INFO] 
[INFO] Apache Hadoop HDFS ................................ FAILURE [  02:39 h]
[INFO] Apache Hadoop HttpFS .............................. SKIPPED
[INFO] Apache Hadoop HDFS BookKeeper Journal ............. SKIPPED
[INFO] Apache Hadoop HDFS-NFS ............................ SKIPPED
[INFO] Apache Hadoop HDFS Project ........................ SUCCESS [  2.204 s]
[INFO] ------------------------------------------------------------------------
[INFO] BUILD FAILURE
[INFO] ------------------------------------------------------------------------
[INFO] Total time: 02:39 h
[INFO] Finished at: 2014-11-18T14:13:48+00:00
[INFO] Final Memory: 63M/836M
[INFO] ------------------------------------------------------------------------
[ERROR] Failed to execute goal org.apache.maven.plugins:maven-surefire-plugin:2.16:test (default-test) on project hadoop-hdfs: There was a timeout or other error in the fork -> [Help 1]
[ERROR] 
[ERROR] To see the full stack trace of the errors, re-run Maven with the -e switch.
[ERROR] Re-run Maven using the -X switch to enable full debug logging.
[ERROR] 
[ERROR] For more information about the errors and possible solutions, please read the following articles:
[ERROR] [Help 1] http://cwiki.apache.org/confluence/display/MAVEN/MojoFailureException
Build step 'Execute shell' marked build as failure
Archiving artifacts
Recording test results
Updating YARN-2414
Updating YARN-2690
Updating HDFS-7146
Updating HADOOP-11157
Updating HDFS-7279
Updating HDFS-6982
Updating MAPREDUCE-6162
Updating YARN-2574
Updating HDFS-7404
Updating HADOOP-11311
Updating HDFS-7399
Sending e-mails to: hdfs-dev@hadoop.apache.org
Email was triggered for: Failure
Sending email for trigger: Failure



###################################################################################
############################## FAILED TESTS (if any) ##############################
48 tests failed.
REGRESSION:  org.apache.hadoop.hdfs.TestEncryptionZones.testVersionAndSuiteNegotiation

Error Message:
Uppercase key names are unsupported: testKey

Stack Trace:
java.lang.IllegalArgumentException: Uppercase key names are unsupported: testKey
	at com.google.common.base.Preconditions.checkArgument(Preconditions.java:115)
	at org.apache.hadoop.crypto.key.JavaKeyStoreProvider.createKey(JavaKeyStoreProvider.java:427)
	at org.apache.hadoop.crypto.key.KeyProvider.createKey(KeyProvider.java:515)
	at org.apache.hadoop.crypto.key.KeyProviderExtension.createKey(KeyProviderExtension.java:74)
	at org.apache.hadoop.hdfs.DFSTestUtil.createKey(DFSTestUtil.java:1498)
	at org.apache.hadoop.hdfs.DFSTestUtil.createKey(DFSTestUtil.java:1479)
	at org.apache.hadoop.hdfs.TestEncryptionZones.setup(TestEncryptionZones.java:154)


REGRESSION:  org.apache.hadoop.hdfs.TestEncryptionZones.testGetEZAsNonSuperUser

Error Message:
Uppercase key names are unsupported: testKey

Stack Trace:
java.lang.IllegalArgumentException: Uppercase key names are unsupported: testKey
	at com.google.common.base.Preconditions.checkArgument(Preconditions.java:115)
	at org.apache.hadoop.crypto.key.JavaKeyStoreProvider.createKey(JavaKeyStoreProvider.java:427)
	at org.apache.hadoop.crypto.key.KeyProvider.createKey(KeyProvider.java:515)
	at org.apache.hadoop.crypto.key.KeyProviderExtension.createKey(KeyProviderExtension.java:74)
	at org.apache.hadoop.hdfs.DFSTestUtil.createKey(DFSTestUtil.java:1498)
	at org.apache.hadoop.hdfs.DFSTestUtil.createKey(DFSTestUtil.java:1479)
	at org.apache.hadoop.hdfs.TestEncryptionZones.setup(TestEncryptionZones.java:154)


REGRESSION:  org.apache.hadoop.hdfs.TestEncryptionZones.testReadWriteUsingWebHdfs

Error Message:
Uppercase key names are unsupported: testKey

Stack Trace:
java.lang.IllegalArgumentException: Uppercase key names are unsupported: testKey
	at com.google.common.base.Preconditions.checkArgument(Preconditions.java:115)
	at org.apache.hadoop.crypto.key.JavaKeyStoreProvider.createKey(JavaKeyStoreProvider.java:427)
	at org.apache.hadoop.crypto.key.KeyProvider.createKey(KeyProvider.java:515)
	at org.apache.hadoop.crypto.key.KeyProviderExtension.createKey(KeyProviderExtension.java:74)
	at org.apache.hadoop.hdfs.DFSTestUtil.createKey(DFSTestUtil.java:1498)
	at org.apache.hadoop.hdfs.DFSTestUtil.createKey(DFSTestUtil.java:1479)
	at org.apache.hadoop.hdfs.TestEncryptionZones.setup(TestEncryptionZones.java:154)


REGRESSION:  org.apache.hadoop.hdfs.TestEncryptionZones.testDelegationToken

Error Message:
Uppercase key names are unsupported: testKey

Stack Trace:
java.lang.IllegalArgumentException: Uppercase key names are unsupported: testKey
	at com.google.common.base.Preconditions.checkArgument(Preconditions.java:115)
	at org.apache.hadoop.crypto.key.JavaKeyStoreProvider.createKey(JavaKeyStoreProvider.java:427)
	at org.apache.hadoop.crypto.key.KeyProvider.createKey(KeyProvider.java:515)
	at org.apache.hadoop.crypto.key.KeyProviderExtension.createKey(KeyProviderExtension.java:74)
	at org.apache.hadoop.hdfs.DFSTestUtil.createKey(DFSTestUtil.java:1498)
	at org.apache.hadoop.hdfs.DFSTestUtil.createKey(DFSTestUtil.java:1479)
	at org.apache.hadoop.hdfs.TestEncryptionZones.setup(TestEncryptionZones.java:154)


REGRESSION:  org.apache.hadoop.hdfs.TestEncryptionZones.testEncryptionZonesOnRootPath

Error Message:
Uppercase key names are unsupported: testKey

Stack Trace:
java.lang.IllegalArgumentException: Uppercase key names are unsupported: testKey
	at com.google.common.base.Preconditions.checkArgument(Preconditions.java:115)
	at org.apache.hadoop.crypto.key.JavaKeyStoreProvider.createKey(JavaKeyStoreProvider.java:427)
	at org.apache.hadoop.crypto.key.KeyProvider.createKey(KeyProvider.java:515)
	at org.apache.hadoop.crypto.key.KeyProviderExtension.createKey(KeyProviderExtension.java:74)
	at org.apache.hadoop.hdfs.DFSTestUtil.createKey(DFSTestUtil.java:1498)
	at org.apache.hadoop.hdfs.DFSTestUtil.createKey(DFSTestUtil.java:1479)
	at org.apache.hadoop.hdfs.TestEncryptionZones.setup(TestEncryptionZones.java:154)


REGRESSION:  org.apache.hadoop.hdfs.TestEncryptionZones.testReadWrite

Error Message:
Uppercase key names are unsupported: testKey

Stack Trace:
java.lang.IllegalArgumentException: Uppercase key names are unsupported: testKey
	at com.google.common.base.Preconditions.checkArgument(Preconditions.java:115)
	at org.apache.hadoop.crypto.key.JavaKeyStoreProvider.createKey(JavaKeyStoreProvider.java:427)
	at org.apache.hadoop.crypto.key.KeyProvider.createKey(KeyProvider.java:515)
	at org.apache.hadoop.crypto.key.KeyProviderExtension.createKey(KeyProviderExtension.java:74)
	at org.apache.hadoop.hdfs.DFSTestUtil.createKey(DFSTestUtil.java:1498)
	at org.apache.hadoop.hdfs.DFSTestUtil.createKey(DFSTestUtil.java:1479)
	at org.apache.hadoop.hdfs.TestEncryptionZones.setup(TestEncryptionZones.java:154)


REGRESSION:  org.apache.hadoop.hdfs.TestEncryptionZones.testRenameFileSystem

Error Message:
Uppercase key names are unsupported: testKey

Stack Trace:
java.lang.IllegalArgumentException: Uppercase key names are unsupported: testKey
	at com.google.common.base.Preconditions.checkArgument(Preconditions.java:115)
	at org.apache.hadoop.crypto.key.JavaKeyStoreProvider.createKey(JavaKeyStoreProvider.java:427)
	at org.apache.hadoop.crypto.key.KeyProvider.createKey(KeyProvider.java:515)
	at org.apache.hadoop.crypto.key.KeyProviderExtension.createKey(KeyProviderExtension.java:74)
	at org.apache.hadoop.hdfs.DFSTestUtil.createKey(DFSTestUtil.java:1498)
	at org.apache.hadoop.hdfs.DFSTestUtil.createKey(DFSTestUtil.java:1479)
	at org.apache.hadoop.hdfs.TestEncryptionZones.setup(TestEncryptionZones.java:154)


REGRESSION:  org.apache.hadoop.hdfs.TestEncryptionZones.testListEncryptionZonesAsNonSuperUser

Error Message:
Uppercase key names are unsupported: testKey

Stack Trace:
java.lang.IllegalArgumentException: Uppercase key names are unsupported: testKey
	at com.google.common.base.Preconditions.checkArgument(Preconditions.java:115)
	at org.apache.hadoop.crypto.key.JavaKeyStoreProvider.createKey(JavaKeyStoreProvider.java:427)
	at org.apache.hadoop.crypto.key.KeyProvider.createKey(KeyProvider.java:515)
	at org.apache.hadoop.crypto.key.KeyProviderExtension.createKey(KeyProviderExtension.java:74)
	at org.apache.hadoop.hdfs.DFSTestUtil.createKey(DFSTestUtil.java:1498)
	at org.apache.hadoop.hdfs.DFSTestUtil.createKey(DFSTestUtil.java:1479)
	at org.apache.hadoop.hdfs.TestEncryptionZones.setup(TestEncryptionZones.java:154)


REGRESSION:  org.apache.hadoop.hdfs.TestEncryptionZones.testSnapshotsOnEncryptionZones

Error Message:
Uppercase key names are unsupported: testKey

Stack Trace:
java.lang.IllegalArgumentException: Uppercase key names are unsupported: testKey
	at com.google.common.base.Preconditions.checkArgument(Preconditions.java:115)
	at org.apache.hadoop.crypto.key.JavaKeyStoreProvider.createKey(JavaKeyStoreProvider.java:427)
	at org.apache.hadoop.crypto.key.KeyProvider.createKey(KeyProvider.java:515)
	at org.apache.hadoop.crypto.key.KeyProviderExtension.createKey(KeyProviderExtension.java:74)
	at org.apache.hadoop.hdfs.DFSTestUtil.createKey(DFSTestUtil.java:1498)
	at org.apache.hadoop.hdfs.DFSTestUtil.createKey(DFSTestUtil.java:1479)
	at org.apache.hadoop.hdfs.TestEncryptionZones.setup(TestEncryptionZones.java:154)


REGRESSION:  org.apache.hadoop.hdfs.TestEncryptionZones.testConcatFailsInEncryptionZones

Error Message:
Uppercase key names are unsupported: testKey

Stack Trace:
java.lang.IllegalArgumentException: Uppercase key names are unsupported: testKey
	at com.google.common.base.Preconditions.checkArgument(Preconditions.java:115)
	at org.apache.hadoop.crypto.key.JavaKeyStoreProvider.createKey(JavaKeyStoreProvider.java:427)
	at org.apache.hadoop.crypto.key.KeyProvider.createKey(KeyProvider.java:515)
	at org.apache.hadoop.crypto.key.KeyProviderExtension.createKey(KeyProviderExtension.java:74)
	at org.apache.hadoop.hdfs.DFSTestUtil.createKey(DFSTestUtil.java:1498)
	at org.apache.hadoop.hdfs.DFSTestUtil.createKey(DFSTestUtil.java:1479)
	at org.apache.hadoop.hdfs.TestEncryptionZones.setup(TestEncryptionZones.java:154)


REGRESSION:  org.apache.hadoop.hdfs.TestEncryptionZones.testOfflineImageViewerOnEncryptionZones

Error Message:
Uppercase key names are unsupported: testKey

Stack Trace:
java.lang.IllegalArgumentException: Uppercase key names are unsupported: testKey
	at com.google.common.base.Preconditions.checkArgument(Preconditions.java:115)
	at org.apache.hadoop.crypto.key.JavaKeyStoreProvider.createKey(JavaKeyStoreProvider.java:427)
	at org.apache.hadoop.crypto.key.KeyProvider.createKey(KeyProvider.java:515)
	at org.apache.hadoop.crypto.key.KeyProviderExtension.createKey(KeyProviderExtension.java:74)
	at org.apache.hadoop.hdfs.DFSTestUtil.createKey(DFSTestUtil.java:1498)
	at org.apache.hadoop.hdfs.DFSTestUtil.createKey(DFSTestUtil.java:1479)
	at org.apache.hadoop.hdfs.TestEncryptionZones.setup(TestEncryptionZones.java:154)


REGRESSION:  org.apache.hadoop.hdfs.TestEncryptionZones.testRenameFileContext

Error Message:
Uppercase key names are unsupported: testKey

Stack Trace:
java.lang.IllegalArgumentException: Uppercase key names are unsupported: testKey
	at com.google.common.base.Preconditions.checkArgument(Preconditions.java:115)
	at org.apache.hadoop.crypto.key.JavaKeyStoreProvider.createKey(JavaKeyStoreProvider.java:427)
	at org.apache.hadoop.crypto.key.KeyProvider.createKey(KeyProvider.java:515)
	at org.apache.hadoop.crypto.key.KeyProviderExtension.createKey(KeyProviderExtension.java:74)
	at org.apache.hadoop.hdfs.DFSTestUtil.createKey(DFSTestUtil.java:1498)
	at org.apache.hadoop.hdfs.DFSTestUtil.createKey(DFSTestUtil.java:1479)
	at org.apache.hadoop.hdfs.TestEncryptionZones.setup(TestEncryptionZones.java:154)


REGRESSION:  org.apache.hadoop.hdfs.TestEncryptionZones.testFsckOnEncryptionZones

Error Message:
Uppercase key names are unsupported: testKey

Stack Trace:
java.lang.IllegalArgumentException: Uppercase key names are unsupported: testKey
	at com.google.common.base.Preconditions.checkArgument(Preconditions.java:115)
	at org.apache.hadoop.crypto.key.JavaKeyStoreProvider.createKey(JavaKeyStoreProvider.java:427)
	at org.apache.hadoop.crypto.key.KeyProvider.createKey(KeyProvider.java:515)
	at org.apache.hadoop.crypto.key.KeyProviderExtension.createKey(KeyProviderExtension.java:74)
	at org.apache.hadoop.hdfs.DFSTestUtil.createKey(DFSTestUtil.java:1498)
	at org.apache.hadoop.hdfs.DFSTestUtil.createKey(DFSTestUtil.java:1479)
	at org.apache.hadoop.hdfs.TestEncryptionZones.setup(TestEncryptionZones.java:154)


REGRESSION:  org.apache.hadoop.hdfs.TestEncryptionZones.testBasicOperations

Error Message:
Uppercase key names are unsupported: testKey

Stack Trace:
java.lang.IllegalArgumentException: Uppercase key names are unsupported: testKey
	at com.google.common.base.Preconditions.checkArgument(Preconditions.java:115)
	at org.apache.hadoop.crypto.key.JavaKeyStoreProvider.createKey(JavaKeyStoreProvider.java:427)
	at org.apache.hadoop.crypto.key.KeyProvider.createKey(KeyProvider.java:515)
	at org.apache.hadoop.crypto.key.KeyProviderExtension.createKey(KeyProviderExtension.java:74)
	at org.apache.hadoop.hdfs.DFSTestUtil.createKey(DFSTestUtil.java:1498)
	at org.apache.hadoop.hdfs.DFSTestUtil.createKey(DFSTestUtil.java:1479)
	at org.apache.hadoop.hdfs.TestEncryptionZones.setup(TestEncryptionZones.java:154)


REGRESSION:  org.apache.hadoop.hdfs.TestEncryptionZones.testCreateEZWithNoProvider

Error Message:
Uppercase key names are unsupported: testKey

Stack Trace:
java.lang.IllegalArgumentException: Uppercase key names are unsupported: testKey
	at com.google.common.base.Preconditions.checkArgument(Preconditions.java:115)
	at org.apache.hadoop.crypto.key.JavaKeyStoreProvider.createKey(JavaKeyStoreProvider.java:427)
	at org.apache.hadoop.crypto.key.KeyProvider.createKey(KeyProvider.java:515)
	at org.apache.hadoop.crypto.key.KeyProviderExtension.createKey(KeyProviderExtension.java:74)
	at org.apache.hadoop.hdfs.DFSTestUtil.createKey(DFSTestUtil.java:1498)
	at org.apache.hadoop.hdfs.DFSTestUtil.createKey(DFSTestUtil.java:1479)
	at org.apache.hadoop.hdfs.TestEncryptionZones.setup(TestEncryptionZones.java:154)


REGRESSION:  org.apache.hadoop.hdfs.TestEncryptionZones.testStartFileRetry

Error Message:
Uppercase key names are unsupported: testKey

Stack Trace:
java.lang.IllegalArgumentException: Uppercase key names are unsupported: testKey
	at com.google.common.base.Preconditions.checkArgument(Preconditions.java:115)
	at org.apache.hadoop.crypto.key.JavaKeyStoreProvider.createKey(JavaKeyStoreProvider.java:427)
	at org.apache.hadoop.crypto.key.KeyProvider.createKey(KeyProvider.java:515)
	at org.apache.hadoop.crypto.key.KeyProviderExtension.createKey(KeyProviderExtension.java:74)
	at org.apache.hadoop.hdfs.DFSTestUtil.createKey(DFSTestUtil.java:1498)
	at org.apache.hadoop.hdfs.DFSTestUtil.createKey(DFSTestUtil.java:1479)
	at org.apache.hadoop.hdfs.TestEncryptionZones.setup(TestEncryptionZones.java:154)


REGRESSION:  org.apache.hadoop.hdfs.TestEncryptionZones.testEncryptionZonesWithSymlinks

Error Message:
Uppercase key names are unsupported: testKey

Stack Trace:
java.lang.IllegalArgumentException: Uppercase key names are unsupported: testKey
	at com.google.common.base.Preconditions.checkArgument(Preconditions.java:115)
	at org.apache.hadoop.crypto.key.JavaKeyStoreProvider.createKey(JavaKeyStoreProvider.java:427)
	at org.apache.hadoop.crypto.key.KeyProvider.createKey(KeyProvider.java:515)
	at org.apache.hadoop.crypto.key.KeyProviderExtension.createKey(KeyProviderExtension.java:74)
	at org.apache.hadoop.hdfs.DFSTestUtil.createKey(DFSTestUtil.java:1498)
	at org.apache.hadoop.hdfs.DFSTestUtil.createKey(DFSTestUtil.java:1479)
	at org.apache.hadoop.hdfs.TestEncryptionZones.setup(TestEncryptionZones.java:154)


REGRESSION:  org.apache.hadoop.hdfs.TestEncryptionZones.testIsEncryptedMethod

Error Message:
Uppercase key names are unsupported: testKey

Stack Trace:
java.lang.IllegalArgumentException: Uppercase key names are unsupported: testKey
	at com.google.common.base.Preconditions.checkArgument(Preconditions.java:115)
	at org.apache.hadoop.crypto.key.JavaKeyStoreProvider.createKey(JavaKeyStoreProvider.java:427)
	at org.apache.hadoop.crypto.key.KeyProvider.createKey(KeyProvider.java:515)
	at org.apache.hadoop.crypto.key.KeyProviderExtension.createKey(KeyProviderExtension.java:74)
	at org.apache.hadoop.hdfs.DFSTestUtil.createKey(DFSTestUtil.java:1498)
	at org.apache.hadoop.hdfs.DFSTestUtil.createKey(DFSTestUtil.java:1479)
	at org.apache.hadoop.hdfs.TestEncryptionZones.setup(TestEncryptionZones.java:154)


REGRESSION:  org.apache.hadoop.hdfs.TestEncryptionZonesWithHA.testEncryptionZonesTrackedOnStandby

Error Message:
Uppercase key names are unsupported: testKey

Stack Trace:
java.lang.IllegalArgumentException: Uppercase key names are unsupported: testKey
	at com.google.common.base.Preconditions.checkArgument(Preconditions.java:115)
	at org.apache.hadoop.crypto.key.JavaKeyStoreProvider.createKey(JavaKeyStoreProvider.java:427)
	at org.apache.hadoop.crypto.key.KeyProvider.createKey(KeyProvider.java:515)
	at org.apache.hadoop.crypto.key.KeyProviderExtension.createKey(KeyProviderExtension.java:74)
	at org.apache.hadoop.hdfs.DFSTestUtil.createKey(DFSTestUtil.java:1498)
	at org.apache.hadoop.hdfs.TestEncryptionZonesWithHA.setupCluster(TestEncryptionZonesWithHA.java:75)


REGRESSION:  org.apache.hadoop.hdfs.TestEncryptionZonesWithKMS.testDelegationToken

Error Message:
Uppercase key names are unsupported: testKey

Stack Trace:
java.lang.IllegalArgumentException: Uppercase key names are unsupported: testKey
	at sun.reflect.NativeConstructorAccessorImpl.newInstance0(Native Method)
	at sun.reflect.NativeConstructorAccessorImpl.newInstance(NativeConstructorAccessorImpl.java:39)
	at sun.reflect.DelegatingConstructorAccessorImpl.newInstance(DelegatingConstructorAccessorImpl.java:27)
	at java.lang.reflect.Constructor.newInstance(Constructor.java:513)
	at org.apache.hadoop.util.HttpExceptionUtils.validateResponse(HttpExceptionUtils.java:157)
	at org.apache.hadoop.crypto.key.kms.KMSClientProvider.call(KMSClientProvider.java:484)
	at org.apache.hadoop.crypto.key.kms.KMSClientProvider.call(KMSClientProvider.java:442)
	at org.apache.hadoop.crypto.key.kms.KMSClientProvider.createKeyInternal(KMSClientProvider.java:615)
	at org.apache.hadoop.crypto.key.kms.KMSClientProvider.createKey(KMSClientProvider.java:623)
	at org.apache.hadoop.crypto.key.KeyProviderExtension.createKey(KeyProviderExtension.java:74)
	at org.apache.hadoop.hdfs.DFSTestUtil.createKey(DFSTestUtil.java:1498)
	at org.apache.hadoop.hdfs.DFSTestUtil.createKey(DFSTestUtil.java:1479)
	at org.apache.hadoop.hdfs.TestEncryptionZones.setup(TestEncryptionZones.java:154)
	at org.apache.hadoop.hdfs.TestEncryptionZonesWithKMS.setup(TestEncryptionZonesWithKMS.java:56)


REGRESSION:  org.apache.hadoop.hdfs.TestEncryptionZonesWithKMS.testCreateEZPopulatesEDEKCache

Error Message:
Uppercase key names are unsupported: testKey

Stack Trace:
java.lang.IllegalArgumentException: Uppercase key names are unsupported: testKey
	at sun.reflect.NativeConstructorAccessorImpl.newInstance0(Native Method)
	at sun.reflect.NativeConstructorAccessorImpl.newInstance(NativeConstructorAccessorImpl.java:39)
	at sun.reflect.DelegatingConstructorAccessorImpl.newInstance(DelegatingConstructorAccessorImpl.java:27)
	at java.lang.reflect.Constructor.newInstance(Constructor.java:513)
	at org.apache.hadoop.util.HttpExceptionUtils.validateResponse(HttpExceptionUtils.java:157)
	at org.apache.hadoop.crypto.key.kms.KMSClientProvider.call(KMSClientProvider.java:484)
	at org.apache.hadoop.crypto.key.kms.KMSClientProvider.call(KMSClientProvider.java:442)
	at org.apache.hadoop.crypto.key.kms.KMSClientProvider.createKeyInternal(KMSClientProvider.java:615)
	at org.apache.hadoop.crypto.key.kms.KMSClientProvider.createKey(KMSClientProvider.java:623)
	at org.apache.hadoop.crypto.key.KeyProviderExtension.createKey(KeyProviderExtension.java:74)
	at org.apache.hadoop.hdfs.DFSTestUtil.createKey(DFSTestUtil.java:1498)
	at org.apache.hadoop.hdfs.DFSTestUtil.createKey(DFSTestUtil.java:1479)
	at org.apache.hadoop.hdfs.TestEncryptionZones.setup(TestEncryptionZones.java:154)
	at org.apache.hadoop.hdfs.TestEncryptionZonesWithKMS.setup(TestEncryptionZonesWithKMS.java:56)


REGRESSION:  org.apache.hadoop.hdfs.TestEncryptionZonesWithKMS.testVersionAndSuiteNegotiation

Error Message:
Uppercase key names are unsupported: testKey

Stack Trace:
java.lang.IllegalArgumentException: Uppercase key names are unsupported: testKey
	at sun.reflect.NativeConstructorAccessorImpl.newInstance0(Native Method)
	at sun.reflect.NativeConstructorAccessorImpl.newInstance(NativeConstructorAccessorImpl.java:39)
	at sun.reflect.DelegatingConstructorAccessorImpl.newInstance(DelegatingConstructorAccessorImpl.java:27)
	at java.lang.reflect.Constructor.newInstance(Constructor.java:513)
	at org.apache.hadoop.util.HttpExceptionUtils.validateResponse(HttpExceptionUtils.java:157)
	at org.apache.hadoop.crypto.key.kms.KMSClientProvider.call(KMSClientProvider.java:484)
	at org.apache.hadoop.crypto.key.kms.KMSClientProvider.call(KMSClientProvider.java:442)
	at org.apache.hadoop.crypto.key.kms.KMSClientProvider.createKeyInternal(KMSClientProvider.java:615)
	at org.apache.hadoop.crypto.key.kms.KMSClientProvider.createKey(KMSClientProvider.java:623)
	at org.apache.hadoop.crypto.key.KeyProviderExtension.createKey(KeyProviderExtension.java:74)
	at org.apache.hadoop.hdfs.DFSTestUtil.createKey(DFSTestUtil.java:1498)
	at org.apache.hadoop.hdfs.DFSTestUtil.createKey(DFSTestUtil.java:1479)
	at org.apache.hadoop.hdfs.TestEncryptionZones.setup(TestEncryptionZones.java:154)
	at org.apache.hadoop.hdfs.TestEncryptionZonesWithKMS.setup(TestEncryptionZonesWithKMS.java:56)


REGRESSION:  org.apache.hadoop.hdfs.TestEncryptionZonesWithKMS.testGetEZAsNonSuperUser

Error Message:
Uppercase key names are unsupported: testKey

Stack Trace:
java.lang.IllegalArgumentException: Uppercase key names are unsupported: testKey
	at sun.reflect.NativeConstructorAccessorImpl.newInstance0(Native Method)
	at sun.reflect.NativeConstructorAccessorImpl.newInstance(NativeConstructorAccessorImpl.java:39)
	at sun.reflect.DelegatingConstructorAccessorImpl.newInstance(DelegatingConstructorAccessorImpl.java:27)
	at java.lang.reflect.Constructor.newInstance(Constructor.java:513)
	at org.apache.hadoop.util.HttpExceptionUtils.validateResponse(HttpExceptionUtils.java:157)
	at org.apache.hadoop.crypto.key.kms.KMSClientProvider.call(KMSClientProvider.java:484)
	at org.apache.hadoop.crypto.key.kms.KMSClientProvider.call(KMSClientProvider.java:442)
	at org.apache.hadoop.crypto.key.kms.KMSClientProvider.createKeyInternal(KMSClientProvider.java:615)
	at org.apache.hadoop.crypto.key.kms.KMSClientProvider.createKey(KMSClientProvider.java:623)
	at org.apache.hadoop.crypto.key.KeyProviderExtension.createKey(KeyProviderExtension.java:74)
	at org.apache.hadoop.hdfs.DFSTestUtil.createKey(DFSTestUtil.java:1498)
	at org.apache.hadoop.hdfs.DFSTestUtil.createKey(DFSTestUtil.java:1479)
	at org.apache.hadoop.hdfs.TestEncryptionZones.setup(TestEncryptionZones.java:154)
	at org.apache.hadoop.hdfs.TestEncryptionZonesWithKMS.setup(TestEncryptionZonesWithKMS.java:56)


REGRESSION:  org.apache.hadoop.hdfs.TestEncryptionZonesWithKMS.testReadWriteUsingWebHdfs

Error Message:
Uppercase key names are unsupported: testKey

Stack Trace:
java.lang.IllegalArgumentException: Uppercase key names are unsupported: testKey
	at sun.reflect.NativeConstructorAccessorImpl.newInstance0(Native Method)
	at sun.reflect.NativeConstructorAccessorImpl.newInstance(NativeConstructorAccessorImpl.java:39)
	at sun.reflect.DelegatingConstructorAccessorImpl.newInstance(DelegatingConstructorAccessorImpl.java:27)
	at java.lang.reflect.Constructor.newInstance(Constructor.java:513)
	at org.apache.hadoop.util.HttpExceptionUtils.validateResponse(HttpExceptionUtils.java:157)
	at org.apache.hadoop.crypto.key.kms.KMSClientProvider.call(KMSClientProvider.java:484)
	at org.apache.hadoop.crypto.key.kms.KMSClientProvider.call(KMSClientProvider.java:442)
	at org.apache.hadoop.crypto.key.kms.KMSClientProvider.createKeyInternal(KMSClientProvider.java:615)
	at org.apache.hadoop.crypto.key.kms.KMSClientProvider.createKey(KMSClientProvider.java:623)
	at org.apache.hadoop.crypto.key.KeyProviderExtension.createKey(KeyProviderExtension.java:74)
	at org.apache.hadoop.hdfs.DFSTestUtil.createKey(DFSTestUtil.java:1498)
	at org.apache.hadoop.hdfs.DFSTestUtil.createKey(DFSTestUtil.java:1479)
	at org.apache.hadoop.hdfs.TestEncryptionZones.setup(TestEncryptionZones.java:154)
	at org.apache.hadoop.hdfs.TestEncryptionZonesWithKMS.setup(TestEncryptionZonesWithKMS.java:56)


REGRESSION:  org.apache.hadoop.hdfs.TestEncryptionZonesWithKMS.testEncryptionZonesOnRootPath

Error Message:
Uppercase key names are unsupported: testKey

Stack Trace:
java.lang.IllegalArgumentException: Uppercase key names are unsupported: testKey
	at sun.reflect.NativeConstructorAccessorImpl.newInstance0(Native Method)
	at sun.reflect.NativeConstructorAccessorImpl.newInstance(NativeConstructorAccessorImpl.java:39)
	at sun.reflect.DelegatingConstructorAccessorImpl.newInstance(DelegatingConstructorAccessorImpl.java:27)
	at java.lang.reflect.Constructor.newInstance(Constructor.java:513)
	at org.apache.hadoop.util.HttpExceptionUtils.validateResponse(HttpExceptionUtils.java:157)
	at org.apache.hadoop.crypto.key.kms.KMSClientProvider.call(KMSClientProvider.java:484)
	at org.apache.hadoop.crypto.key.kms.KMSClientProvider.call(KMSClientProvider.java:442)
	at org.apache.hadoop.crypto.key.kms.KMSClientProvider.createKeyInternal(KMSClientProvider.java:615)
	at org.apache.hadoop.crypto.key.kms.KMSClientProvider.createKey(KMSClientProvider.java:623)
	at org.apache.hadoop.crypto.key.KeyProviderExtension.createKey(KeyProviderExtension.java:74)
	at org.apache.hadoop.hdfs.DFSTestUtil.createKey(DFSTestUtil.java:1498)
	at org.apache.hadoop.hdfs.DFSTestUtil.createKey(DFSTestUtil.java:1479)
	at org.apache.hadoop.hdfs.TestEncryptionZones.setup(TestEncryptionZones.java:154)
	at org.apache.hadoop.hdfs.TestEncryptionZonesWithKMS.setup(TestEncryptionZonesWithKMS.java:56)


REGRESSION:  org.apache.hadoop.hdfs.TestEncryptionZonesWithKMS.testReadWrite

Error Message:
Uppercase key names are unsupported: testKey

Stack Trace:
java.lang.IllegalArgumentException: Uppercase key names are unsupported: testKey
	at sun.reflect.NativeConstructorAccessorImpl.newInstance0(Native Method)
	at sun.reflect.NativeConstructorAccessorImpl.newInstance(NativeConstructorAccessorImpl.java:39)
	at sun.reflect.DelegatingConstructorAccessorImpl.newInstance(DelegatingConstructorAccessorImpl.java:27)
	at java.lang.reflect.Constructor.newInstance(Constructor.java:513)
	at org.apache.hadoop.util.HttpExceptionUtils.validateResponse(HttpExceptionUtils.java:157)
	at org.apache.hadoop.crypto.key.kms.KMSClientProvider.call(KMSClientProvider.java:484)
	at org.apache.hadoop.crypto.key.kms.KMSClientProvider.call(KMSClientProvider.java:442)
	at org.apache.hadoop.crypto.key.kms.KMSClientProvider.createKeyInternal(KMSClientProvider.java:615)
	at org.apache.hadoop.crypto.key.kms.KMSClientProvider.createKey(KMSClientProvider.java:623)
	at org.apache.hadoop.crypto.key.KeyProviderExtension.createKey(KeyProviderExtension.java:74)
	at org.apache.hadoop.hdfs.DFSTestUtil.createKey(DFSTestUtil.java:1498)
	at org.apache.hadoop.hdfs.DFSTestUtil.createKey(DFSTestUtil.java:1479)
	at org.apache.hadoop.hdfs.TestEncryptionZones.setup(TestEncryptionZones.java:154)
	at org.apache.hadoop.hdfs.TestEncryptionZonesWithKMS.setup(TestEncryptionZonesWithKMS.java:56)


REGRESSION:  org.apache.hadoop.hdfs.TestEncryptionZonesWithKMS.testRenameFileSystem

Error Message:
Uppercase key names are unsupported: testKey

Stack Trace:
java.lang.IllegalArgumentException: Uppercase key names are unsupported: testKey
	at sun.reflect.NativeConstructorAccessorImpl.newInstance0(Native Method)
	at sun.reflect.NativeConstructorAccessorImpl.newInstance(NativeConstructorAccessorImpl.java:39)
	at sun.reflect.DelegatingConstructorAccessorImpl.newInstance(DelegatingConstructorAccessorImpl.java:27)
	at java.lang.reflect.Constructor.newInstance(Constructor.java:513)
	at org.apache.hadoop.util.HttpExceptionUtils.validateResponse(HttpExceptionUtils.java:157)
	at org.apache.hadoop.crypto.key.kms.KMSClientProvider.call(KMSClientProvider.java:484)
	at org.apache.hadoop.crypto.key.kms.KMSClientProvider.call(KMSClientProvider.java:442)
	at org.apache.hadoop.crypto.key.kms.KMSClientProvider.createKeyInternal(KMSClientProvider.java:615)
	at org.apache.hadoop.crypto.key.kms.KMSClientProvider.createKey(KMSClientProvider.java:623)
	at org.apache.hadoop.crypto.key.KeyProviderExtension.createKey(KeyProviderExtension.java:74)
	at org.apache.hadoop.hdfs.DFSTestUtil.createKey(DFSTestUtil.java:1498)
	at org.apache.hadoop.hdfs.DFSTestUtil.createKey(DFSTestUtil.java:1479)
	at org.apache.hadoop.hdfs.TestEncryptionZones.setup(TestEncryptionZones.java:154)
	at org.apache.hadoop.hdfs.TestEncryptionZonesWithKMS.setup(TestEncryptionZonesWithKMS.java:56)


REGRESSION:  org.apache.hadoop.hdfs.TestEncryptionZonesWithKMS.testListEncryptionZonesAsNonSuperUser

Error Message:
Uppercase key names are unsupported: testKey

Stack Trace:
java.lang.IllegalArgumentException: Uppercase key names are unsupported: testKey
	at sun.reflect.NativeConstructorAccessorImpl.newInstance0(Native Method)
	at sun.reflect.NativeConstructorAccessorImpl.newInstance(NativeConstructorAccessorImpl.java:39)
	at sun.reflect.DelegatingConstructorAccessorImpl.newInstance(DelegatingConstructorAccessorImpl.java:27)
	at java.lang.reflect.Constructor.newInstance(Constructor.java:513)
	at org.apache.hadoop.util.HttpExceptionUtils.validateResponse(HttpExceptionUtils.java:157)
	at org.apache.hadoop.crypto.key.kms.KMSClientProvider.call(KMSClientProvider.java:484)
	at org.apache.hadoop.crypto.key.kms.KMSClientProvider.call(KMSClientProvider.java:442)
	at org.apache.hadoop.crypto.key.kms.KMSClientProvider.createKeyInternal(KMSClientProvider.java:615)
	at org.apache.hadoop.crypto.key.kms.KMSClientProvider.createKey(KMSClientProvider.java:623)
	at org.apache.hadoop.crypto.key.KeyProviderExtension.createKey(KeyProviderExtension.java:74)
	at org.apache.hadoop.hdfs.DFSTestUtil.createKey(DFSTestUtil.java:1498)
	at org.apache.hadoop.hdfs.DFSTestUtil.createKey(DFSTestUtil.java:1479)
	at org.apache.hadoop.hdfs.TestEncryptionZones.setup(TestEncryptionZones.java:154)
	at org.apache.hadoop.hdfs.TestEncryptionZonesWithKMS.setup(TestEncryptionZonesWithKMS.java:56)


REGRESSION:  org.apache.hadoop.hdfs.TestEncryptionZonesWithKMS.testSnapshotsOnEncryptionZones

Error Message:
Uppercase key names are unsupported: testKey

Stack Trace:
java.lang.IllegalArgumentException: Uppercase key names are unsupported: testKey
	at sun.reflect.NativeConstructorAccessorImpl.newInstance0(Native Method)
	at sun.reflect.NativeConstructorAccessorImpl.newInstance(NativeConstructorAccessorImpl.java:39)
	at sun.reflect.DelegatingConstructorAccessorImpl.newInstance(DelegatingConstructorAccessorImpl.java:27)
	at java.lang.reflect.Constructor.newInstance(Constructor.java:513)
	at org.apache.hadoop.util.HttpExceptionUtils.validateResponse(HttpExceptionUtils.java:157)
	at org.apache.hadoop.crypto.key.kms.KMSClientProvider.call(KMSClientProvider.java:484)
	at org.apache.hadoop.crypto.key.kms.KMSClientProvider.call(KMSClientProvider.java:442)
	at org.apache.hadoop.crypto.key.kms.KMSClientProvider.createKeyInternal(KMSClientProvider.java:615)
	at org.apache.hadoop.crypto.key.kms.KMSClientProvider.createKey(KMSClientProvider.java:623)
	at org.apache.hadoop.crypto.key.KeyProviderExtension.createKey(KeyProviderExtension.java:74)
	at org.apache.hadoop.hdfs.DFSTestUtil.createKey(DFSTestUtil.java:1498)
	at org.apache.hadoop.hdfs.DFSTestUtil.createKey(DFSTestUtil.java:1479)
	at org.apache.hadoop.hdfs.TestEncryptionZones.setup(TestEncryptionZones.java:154)
	at org.apache.hadoop.hdfs.TestEncryptionZonesWithKMS.setup(TestEncryptionZonesWithKMS.java:56)


REGRESSION:  org.apache.hadoop.hdfs.TestEncryptionZonesWithKMS.testConcatFailsInEncryptionZones

Error Message:
Uppercase key names are unsupported: testKey

Stack Trace:
java.lang.IllegalArgumentException: Uppercase key names are unsupported: testKey
	at sun.reflect.NativeConstructorAccessorImpl.newInstance0(Native Method)
	at sun.reflect.NativeConstructorAccessorImpl.newInstance(NativeConstructorAccessorImpl.java:39)
	at sun.reflect.DelegatingConstructorAccessorImpl.newInstance(DelegatingConstructorAccessorImpl.java:27)
	at java.lang.reflect.Constructor.newInstance(Constructor.java:513)
	at org.apache.hadoop.util.HttpExceptionUtils.validateResponse(HttpExceptionUtils.java:157)
	at org.apache.hadoop.crypto.key.kms.KMSClientProvider.call(KMSClientProvider.java:484)
	at org.apache.hadoop.crypto.key.kms.KMSClientProvider.call(KMSClientProvider.java:442)
	at org.apache.hadoop.crypto.key.kms.KMSClientProvider.createKeyInternal(KMSClientProvider.java:615)
	at org.apache.hadoop.crypto.key.kms.KMSClientProvider.createKey(KMSClientProvider.java:623)
	at org.apache.hadoop.crypto.key.KeyProviderExtension.createKey(KeyProviderExtension.java:74)
	at org.apache.hadoop.hdfs.DFSTestUtil.createKey(DFSTestUtil.java:1498)
	at org.apache.hadoop.hdfs.DFSTestUtil.createKey(DFSTestUtil.java:1479)
	at org.apache.hadoop.hdfs.TestEncryptionZones.setup(TestEncryptionZones.java:154)
	at org.apache.hadoop.hdfs.TestEncryptionZonesWithKMS.setup(TestEncryptionZonesWithKMS.java:56)


REGRESSION:  org.apache.hadoop.hdfs.TestEncryptionZonesWithKMS.testOfflineImageViewerOnEncryptionZones

Error Message:
Uppercase key names are unsupported: testKey

Stack Trace:
java.lang.IllegalArgumentException: Uppercase key names are unsupported: testKey
	at sun.reflect.NativeConstructorAccessorImpl.newInstance0(Native Method)
	at sun.reflect.NativeConstructorAccessorImpl.newInstance(NativeConstructorAccessorImpl.java:39)
	at sun.reflect.DelegatingConstructorAccessorImpl.newInstance(DelegatingConstructorAccessorImpl.java:27)
	at java.lang.reflect.Constructor.newInstance(Constructor.java:513)
	at org.apache.hadoop.util.HttpExceptionUtils.validateResponse(HttpExceptionUtils.java:157)
	at org.apache.hadoop.crypto.key.kms.KMSClientProvider.call(KMSClientProvider.java:484)
	at org.apache.hadoop.crypto.key.kms.KMSClientProvider.call(KMSClientProvider.java:442)
	at org.apache.hadoop.crypto.key.kms.KMSClientProvider.createKeyInternal(KMSClientProvider.java:615)
	at org.apache.hadoop.crypto.key.kms.KMSClientProvider.createKey(KMSClientProvider.java:623)
	at org.apache.hadoop.crypto.key.KeyProviderExtension.createKey(KeyProviderExtension.java:74)
	at org.apache.hadoop.hdfs.DFSTestUtil.createKey(DFSTestUtil.java:1498)
	at org.apache.hadoop.hdfs.DFSTestUtil.createKey(DFSTestUtil.java:1479)
	at org.apache.hadoop.hdfs.TestEncryptionZones.setup(TestEncryptionZones.java:154)
	at org.apache.hadoop.hdfs.TestEncryptionZonesWithKMS.setup(TestEncryptionZonesWithKMS.java:56)


REGRESSION:  org.apache.hadoop.hdfs.TestEncryptionZonesWithKMS.testRenameFileContext

Error Message:
Uppercase key names are unsupported: testKey

Stack Trace:
java.lang.IllegalArgumentException: Uppercase key names are unsupported: testKey
	at sun.reflect.NativeConstructorAccessorImpl.newInstance0(Native Method)
	at sun.reflect.NativeConstructorAccessorImpl.newInstance(NativeConstructorAccessorImpl.java:39)
	at sun.reflect.DelegatingConstructorAccessorImpl.newInstance(DelegatingConstructorAccessorImpl.java:27)
	at java.lang.reflect.Constructor.newInstance(Constructor.java:513)
	at org.apache.hadoop.util.HttpExceptionUtils.validateResponse(HttpExceptionUtils.java:157)
	at org.apache.hadoop.crypto.key.kms.KMSClientProvider.call(KMSClientProvider.java:484)
	at org.apache.hadoop.crypto.key.kms.KMSClientProvider.call(KMSClientProvider.java:442)
	at org.apache.hadoop.crypto.key.kms.KMSClientProvider.createKeyInternal(KMSClientProvider.java:615)
	at org.apache.hadoop.crypto.key.kms.KMSClientProvider.createKey(KMSClientProvider.java:623)
	at org.apache.hadoop.crypto.key.KeyProviderExtension.createKey(KeyProviderExtension.java:74)
	at org.apache.hadoop.hdfs.DFSTestUtil.createKey(DFSTestUtil.java:1498)
	at org.apache.hadoop.hdfs.DFSTestUtil.createKey(DFSTestUtil.java:1479)
	at org.apache.hadoop.hdfs.TestEncryptionZones.setup(TestEncryptionZones.java:154)
	at org.apache.hadoop.hdfs.TestEncryptionZonesWithKMS.setup(TestEncryptionZonesWithKMS.java:56)


REGRESSION:  org.apache.hadoop.hdfs.TestEncryptionZonesWithKMS.testFsckOnEncryptionZones

Error Message:
Uppercase key names are unsupported: testKey

Stack Trace:
java.lang.IllegalArgumentException: Uppercase key names are unsupported: testKey
	at sun.reflect.NativeConstructorAccessorImpl.newInstance0(Native Method)
	at sun.reflect.NativeConstructorAccessorImpl.newInstance(NativeConstructorAccessorImpl.java:39)
	at sun.reflect.DelegatingConstructorAccessorImpl.newInstance(DelegatingConstructorAccessorImpl.java:27)
	at java.lang.reflect.Constructor.newInstance(Constructor.java:513)
	at org.apache.hadoop.util.HttpExceptionUtils.validateResponse(HttpExceptionUtils.java:157)
	at org.apache.hadoop.crypto.key.kms.KMSClientProvider.call(KMSClientProvider.java:484)
	at org.apache.hadoop.crypto.key.kms.KMSClientProvider.call(KMSClientProvider.java:442)
	at org.apache.hadoop.crypto.key.kms.KMSClientProvider.createKeyInternal(KMSClientProvider.java:615)
	at org.apache.hadoop.crypto.key.kms.KMSClientProvider.createKey(KMSClientProvider.java:623)
	at org.apache.hadoop.crypto.key.KeyProviderExtension.createKey(KeyProviderExtension.java:74)
	at org.apache.hadoop.hdfs.DFSTestUtil.createKey(DFSTestUtil.java:1498)
	at org.apache.hadoop.hdfs.DFSTestUtil.createKey(DFSTestUtil.java:1479)
	at org.apache.hadoop.hdfs.TestEncryptionZones.setup(TestEncryptionZones.java:154)
	at org.apache.hadoop.hdfs.TestEncryptionZonesWithKMS.setup(TestEncryptionZonesWithKMS.java:56)


REGRESSION:  org.apache.hadoop.hdfs.TestEncryptionZonesWithKMS.testBasicOperations

Error Message:
Uppercase key names are unsupported: testKey

Stack Trace:
java.lang.IllegalArgumentException: Uppercase key names are unsupported: testKey
	at sun.reflect.NativeConstructorAccessorImpl.newInstance0(Native Method)
	at sun.reflect.NativeConstructorAccessorImpl.newInstance(NativeConstructorAccessorImpl.java:39)
	at sun.reflect.DelegatingConstructorAccessorImpl.newInstance(DelegatingConstructorAccessorImpl.java:27)
	at java.lang.reflect.Constructor.newInstance(Constructor.java:513)
	at org.apache.hadoop.util.HttpExceptionUtils.validateResponse(HttpExceptionUtils.java:157)
	at org.apache.hadoop.crypto.key.kms.KMSClientProvider.call(KMSClientProvider.java:484)
	at org.apache.hadoop.crypto.key.kms.KMSClientProvider.call(KMSClientProvider.java:442)
	at org.apache.hadoop.crypto.key.kms.KMSClientProvider.createKeyInternal(KMSClientProvider.java:615)
	at org.apache.hadoop.crypto.key.kms.KMSClientProvider.createKey(KMSClientProvider.java:623)
	at org.apache.hadoop.crypto.key.KeyProviderExtension.createKey(KeyProviderExtension.java:74)
	at org.apache.hadoop.hdfs.DFSTestUtil.createKey(DFSTestUtil.java:1498)
	at org.apache.hadoop.hdfs.DFSTestUtil.createKey(DFSTestUtil.java:1479)
	at org.apache.hadoop.hdfs.TestEncryptionZones.setup(TestEncryptionZones.java:154)
	at org.apache.hadoop.hdfs.TestEncryptionZonesWithKMS.setup(TestEncryptionZonesWithKMS.java:56)


REGRESSION:  org.apache.hadoop.hdfs.TestEncryptionZonesWithKMS.testCreateEZWithNoProvider

Error Message:
Uppercase key names are unsupported: testKey

Stack Trace:
java.lang.IllegalArgumentException: Uppercase key names are unsupported: testKey
	at sun.reflect.NativeConstructorAccessorImpl.newInstance0(Native Method)
	at sun.reflect.NativeConstructorAccessorImpl.newInstance(NativeConstructorAccessorImpl.java:39)
	at sun.reflect.DelegatingConstructorAccessorImpl.newInstance(DelegatingConstructorAccessorImpl.java:27)
	at java.lang.reflect.Constructor.newInstance(Constructor.java:513)
	at org.apache.hadoop.util.HttpExceptionUtils.validateResponse(HttpExceptionUtils.java:157)
	at org.apache.hadoop.crypto.key.kms.KMSClientProvider.call(KMSClientProvider.java:484)
	at org.apache.hadoop.crypto.key.kms.KMSClientProvider.call(KMSClientProvider.java:442)
	at org.apache.hadoop.crypto.key.kms.KMSClientProvider.createKeyInternal(KMSClientProvider.java:615)
	at org.apache.hadoop.crypto.key.kms.KMSClientProvider.createKey(KMSClientProvider.java:623)
	at org.apache.hadoop.crypto.key.KeyProviderExtension.createKey(KeyProviderExtension.java:74)
	at org.apache.hadoop.hdfs.DFSTestUtil.createKey(DFSTestUtil.java:1498)
	at org.apache.hadoop.hdfs.DFSTestUtil.createKey(DFSTestUtil.java:1479)
	at org.apache.hadoop.hdfs.TestEncryptionZones.setup(TestEncryptionZones.java:154)
	at org.apache.hadoop.hdfs.TestEncryptionZonesWithKMS.setup(TestEncryptionZonesWithKMS.java:56)


REGRESSION:  org.apache.hadoop.hdfs.TestEncryptionZonesWithKMS.testStartFileRetry

Error Message:
Uppercase key names are unsupported: testKey

Stack Trace:
java.lang.IllegalArgumentException: Uppercase key names are unsupported: testKey
	at sun.reflect.GeneratedConstructorAccessor242.newInstance(Unknown Source)
	at sun.reflect.DelegatingConstructorAccessorImpl.newInstance(DelegatingConstructorAccessorImpl.java:27)
	at java.lang.reflect.Constructor.newInstance(Constructor.java:513)
	at org.apache.hadoop.util.HttpExceptionUtils.validateResponse(HttpExceptionUtils.java:157)
	at org.apache.hadoop.crypto.key.kms.KMSClientProvider.call(KMSClientProvider.java:484)
	at org.apache.hadoop.crypto.key.kms.KMSClientProvider.call(KMSClientProvider.java:442)
	at org.apache.hadoop.crypto.key.kms.KMSClientProvider.createKeyInternal(KMSClientProvider.java:615)
	at org.apache.hadoop.crypto.key.kms.KMSClientProvider.createKey(KMSClientProvider.java:623)
	at org.apache.hadoop.crypto.key.KeyProviderExtension.createKey(KeyProviderExtension.java:74)
	at org.apache.hadoop.hdfs.DFSTestUtil.createKey(DFSTestUtil.java:1498)
	at org.apache.hadoop.hdfs.DFSTestUtil.createKey(DFSTestUtil.java:1479)
	at org.apache.hadoop.hdfs.TestEncryptionZones.setup(TestEncryptionZones.java:154)
	at org.apache.hadoop.hdfs.TestEncryptionZonesWithKMS.setup(TestEncryptionZonesWithKMS.java:56)


REGRESSION:  org.apache.hadoop.hdfs.TestEncryptionZonesWithKMS.testEncryptionZonesWithSymlinks

Error Message:
Uppercase key names are unsupported: testKey

Stack Trace:
java.lang.IllegalArgumentException: Uppercase key names are unsupported: testKey
	at sun.reflect.GeneratedConstructorAccessor242.newInstance(Unknown Source)
	at sun.reflect.DelegatingConstructorAccessorImpl.newInstance(DelegatingConstructorAccessorImpl.java:27)
	at java.lang.reflect.Constructor.newInstance(Constructor.java:513)
	at org.apache.hadoop.util.HttpExceptionUtils.validateResponse(HttpExceptionUtils.java:157)
	at org.apache.hadoop.crypto.key.kms.KMSClientProvider.call(KMSClientProvider.java:484)
	at org.apache.hadoop.crypto.key.kms.KMSClientProvider.call(KMSClientProvider.java:442)
	at org.apache.hadoop.crypto.key.kms.KMSClientProvider.createKeyInternal(KMSClientProvider.java:615)
	at org.apache.hadoop.crypto.key.kms.KMSClientProvider.createKey(KMSClientProvider.java:623)
	at org.apache.hadoop.crypto.key.KeyProviderExtension.createKey(KeyProviderExtension.java:74)
	at org.apache.hadoop.hdfs.DFSTestUtil.createKey(DFSTestUtil.java:1498)
	at org.apache.hadoop.hdfs.DFSTestUtil.createKey(DFSTestUtil.java:1479)
	at org.apache.hadoop.hdfs.TestEncryptionZones.setup(TestEncryptionZones.java:154)
	at org.apache.hadoop.hdfs.TestEncryptionZonesWithKMS.setup(TestEncryptionZonesWithKMS.java:56)


REGRESSION:  org.apache.hadoop.hdfs.TestEncryptionZonesWithKMS.testIsEncryptedMethod

Error Message:
Uppercase key names are unsupported: testKey

Stack Trace:
java.lang.IllegalArgumentException: Uppercase key names are unsupported: testKey
	at sun.reflect.GeneratedConstructorAccessor242.newInstance(Unknown Source)
	at sun.reflect.DelegatingConstructorAccessorImpl.newInstance(DelegatingConstructorAccessorImpl.java:27)
	at java.lang.reflect.Constructor.newInstance(Constructor.java:513)
	at org.apache.hadoop.util.HttpExceptionUtils.validateResponse(HttpExceptionUtils.java:157)
	at org.apache.hadoop.crypto.key.kms.KMSClientProvider.call(KMSClientProvider.java:484)
	at org.apache.hadoop.crypto.key.kms.KMSClientProvider.call(KMSClientProvider.java:442)
	at org.apache.hadoop.crypto.key.kms.KMSClientProvider.createKeyInternal(KMSClientProvider.java:615)
	at org.apache.hadoop.crypto.key.kms.KMSClientProvider.createKey(KMSClientProvider.java:623)
	at org.apache.hadoop.crypto.key.KeyProviderExtension.createKey(KeyProviderExtension.java:74)
	at org.apache.hadoop.hdfs.DFSTestUtil.createKey(DFSTestUtil.java:1498)
	at org.apache.hadoop.hdfs.DFSTestUtil.createKey(DFSTestUtil.java:1479)
	at org.apache.hadoop.hdfs.TestEncryptionZones.setup(TestEncryptionZones.java:154)
	at org.apache.hadoop.hdfs.TestEncryptionZonesWithKMS.setup(TestEncryptionZonesWithKMS.java:56)


REGRESSION:  org.apache.hadoop.hdfs.TestReservedRawPaths.testListRecursive

Error Message:
Uppercase key names are unsupported: testKey

Stack Trace:
java.lang.IllegalArgumentException: Uppercase key names are unsupported: testKey
	at com.google.common.base.Preconditions.checkArgument(Preconditions.java:115)
	at org.apache.hadoop.crypto.key.JavaKeyStoreProvider.createKey(JavaKeyStoreProvider.java:427)
	at org.apache.hadoop.crypto.key.KeyProvider.createKey(KeyProvider.java:515)
	at org.apache.hadoop.crypto.key.KeyProviderExtension.createKey(KeyProviderExtension.java:74)
	at org.apache.hadoop.hdfs.DFSTestUtil.createKey(DFSTestUtil.java:1498)
	at org.apache.hadoop.hdfs.DFSTestUtil.createKey(DFSTestUtil.java:1479)
	at org.apache.hadoop.hdfs.TestReservedRawPaths.setup(TestReservedRawPaths.java:86)


REGRESSION:  org.apache.hadoop.hdfs.TestReservedRawPaths.testReservedRawMkdir

Error Message:
Uppercase key names are unsupported: testKey

Stack Trace:
java.lang.IllegalArgumentException: Uppercase key names are unsupported: testKey
	at com.google.common.base.Preconditions.checkArgument(Preconditions.java:115)
	at org.apache.hadoop.crypto.key.JavaKeyStoreProvider.createKey(JavaKeyStoreProvider.java:427)
	at org.apache.hadoop.crypto.key.KeyProvider.createKey(KeyProvider.java:515)
	at org.apache.hadoop.crypto.key.KeyProviderExtension.createKey(KeyProviderExtension.java:74)
	at org.apache.hadoop.hdfs.DFSTestUtil.createKey(DFSTestUtil.java:1498)
	at org.apache.hadoop.hdfs.DFSTestUtil.createKey(DFSTestUtil.java:1479)
	at org.apache.hadoop.hdfs.TestReservedRawPaths.setup(TestReservedRawPaths.java:86)


REGRESSION:  org.apache.hadoop.hdfs.TestReservedRawPaths.testListDotReserved

Error Message:
Uppercase key names are unsupported: testKey

Stack Trace:
java.lang.IllegalArgumentException: Uppercase key names are unsupported: testKey
	at com.google.common.base.Preconditions.checkArgument(Preconditions.java:115)
	at org.apache.hadoop.crypto.key.JavaKeyStoreProvider.createKey(JavaKeyStoreProvider.java:427)
	at org.apache.hadoop.crypto.key.KeyProvider.createKey(KeyProvider.java:515)
	at org.apache.hadoop.crypto.key.KeyProviderExtension.createKey(KeyProviderExtension.java:74)
	at org.apache.hadoop.hdfs.DFSTestUtil.createKey(DFSTestUtil.java:1498)
	at org.apache.hadoop.hdfs.DFSTestUtil.createKey(DFSTestUtil.java:1479)
	at org.apache.hadoop.hdfs.TestReservedRawPaths.setup(TestReservedRawPaths.java:86)


REGRESSION:  org.apache.hadoop.hdfs.TestReservedRawPaths.testGetFileStatus

Error Message:
Uppercase key names are unsupported: testKey

Stack Trace:
java.lang.IllegalArgumentException: Uppercase key names are unsupported: testKey
	at com.google.common.base.Preconditions.checkArgument(Preconditions.java:115)
	at org.apache.hadoop.crypto.key.JavaKeyStoreProvider.createKey(JavaKeyStoreProvider.java:427)
	at org.apache.hadoop.crypto.key.KeyProvider.createKey(KeyProvider.java:515)
	at org.apache.hadoop.crypto.key.KeyProviderExtension.createKey(KeyProviderExtension.java:74)
	at org.apache.hadoop.hdfs.DFSTestUtil.createKey(DFSTestUtil.java:1498)
	at org.apache.hadoop.hdfs.DFSTestUtil.createKey(DFSTestUtil.java:1479)
	at org.apache.hadoop.hdfs.TestReservedRawPaths.setup(TestReservedRawPaths.java:86)


REGRESSION:  org.apache.hadoop.hdfs.TestReservedRawPaths.testReservedRoot

Error Message:
Uppercase key names are unsupported: testKey

Stack Trace:
java.lang.IllegalArgumentException: Uppercase key names are unsupported: testKey
	at com.google.common.base.Preconditions.checkArgument(Preconditions.java:115)
	at org.apache.hadoop.crypto.key.JavaKeyStoreProvider.createKey(JavaKeyStoreProvider.java:427)
	at org.apache.hadoop.crypto.key.KeyProvider.createKey(KeyProvider.java:515)
	at org.apache.hadoop.crypto.key.KeyProviderExtension.createKey(KeyProviderExtension.java:74)
	at org.apache.hadoop.hdfs.DFSTestUtil.createKey(DFSTestUtil.java:1498)
	at org.apache.hadoop.hdfs.DFSTestUtil.createKey(DFSTestUtil.java:1479)
	at org.apache.hadoop.hdfs.TestReservedRawPaths.setup(TestReservedRawPaths.java:86)


REGRESSION:  org.apache.hadoop.hdfs.TestReservedRawPaths.testAdminAccessOnly

Error Message:
Uppercase key names are unsupported: testKey

Stack Trace:
java.lang.IllegalArgumentException: Uppercase key names are unsupported: testKey
	at com.google.common.base.Preconditions.checkArgument(Preconditions.java:115)
	at org.apache.hadoop.crypto.key.JavaKeyStoreProvider.createKey(JavaKeyStoreProvider.java:427)
	at org.apache.hadoop.crypto.key.KeyProvider.createKey(KeyProvider.java:515)
	at org.apache.hadoop.crypto.key.KeyProviderExtension.createKey(KeyProviderExtension.java:74)
	at org.apache.hadoop.hdfs.DFSTestUtil.createKey(DFSTestUtil.java:1498)
	at org.apache.hadoop.hdfs.DFSTestUtil.createKey(DFSTestUtil.java:1479)
	at org.apache.hadoop.hdfs.TestReservedRawPaths.setup(TestReservedRawPaths.java:86)


REGRESSION:  org.apache.hadoop.hdfs.TestReservedRawPaths.testReadWriteRaw

Error Message:
Uppercase key names are unsupported: testKey

Stack Trace:
java.lang.IllegalArgumentException: Uppercase key names are unsupported: testKey
	at com.google.common.base.Preconditions.checkArgument(Preconditions.java:115)
	at org.apache.hadoop.crypto.key.JavaKeyStoreProvider.createKey(JavaKeyStoreProvider.java:427)
	at org.apache.hadoop.crypto.key.KeyProvider.createKey(KeyProvider.java:515)
	at org.apache.hadoop.crypto.key.KeyProviderExtension.createKey(KeyProviderExtension.java:74)
	at org.apache.hadoop.hdfs.DFSTestUtil.createKey(DFSTestUtil.java:1498)
	at org.apache.hadoop.hdfs.DFSTestUtil.createKey(DFSTestUtil.java:1479)
	at org.apache.hadoop.hdfs.TestReservedRawPaths.setup(TestReservedRawPaths.java:86)


REGRESSION:  org.apache.hadoop.hdfs.TestReservedRawPaths.testRelativePathnames

Error Message:
Uppercase key names are unsupported: testKey

Stack Trace:
java.lang.IllegalArgumentException: Uppercase key names are unsupported: testKey
	at com.google.common.base.Preconditions.checkArgument(Preconditions.java:115)
	at org.apache.hadoop.crypto.key.JavaKeyStoreProvider.createKey(JavaKeyStoreProvider.java:427)
	at org.apache.hadoop.crypto.key.KeyProvider.createKey(KeyProvider.java:515)
	at org.apache.hadoop.crypto.key.KeyProviderExtension.createKey(KeyProviderExtension.java:74)
	at org.apache.hadoop.hdfs.DFSTestUtil.createKey(DFSTestUtil.java:1498)
	at org.apache.hadoop.hdfs.DFSTestUtil.createKey(DFSTestUtil.java:1479)
	at org.apache.hadoop.hdfs.TestReservedRawPaths.setup(TestReservedRawPaths.java:86)


REGRESSION:  org.apache.hadoop.net.TestNetworkTopology.testInvalidNetworkTopologiesNotCachedInHdfs

Error Message:
Cannot lock storage /home/jenkins/jenkins-slave/workspace/Hadoop-Hdfs-trunk/hadoop-hdfs-project/hadoop-hdfs/target/test/data/dfs/name1. The directory is already locked

Stack Trace:
java.io.IOException: Cannot lock storage /home/jenkins/jenkins-slave/workspace/Hadoop-Hdfs-trunk/hadoop-hdfs-project/hadoop-hdfs/target/test/data/dfs/name1. The directory is already locked
	at org.apache.hadoop.hdfs.server.common.Storage$StorageDirectory.lock(Storage.java:683)
	at org.apache.hadoop.hdfs.server.common.Storage$StorageDirectory.analyzeStorage(Storage.java:499)
	at org.apache.hadoop.hdfs.server.namenode.FSImage.recoverStorageDirs(FSImage.java:308)
	at org.apache.hadoop.hdfs.server.namenode.FSImage.recoverTransitionRead(FSImage.java:202)
	at org.apache.hadoop.hdfs.server.namenode.FSNamesystem.loadFSImage(FSNamesystem.java:1010)
	at org.apache.hadoop.hdfs.server.namenode.FSNamesystem.loadFromDisk(FSNamesystem.java:717)
	at org.apache.hadoop.hdfs.server.namenode.NameNode.loadNamesystem(NameNode.java:537)
	at org.apache.hadoop.hdfs.server.namenode.NameNode.initialize(NameNode.java:596)
	at org.apache.hadoop.hdfs.server.namenode.NameNode.<init>(NameNode.java:763)
	at org.apache.hadoop.hdfs.server.namenode.NameNode.<init>(NameNode.java:747)
	at org.apache.hadoop.hdfs.server.namenode.NameNode.createNameNode(NameNode.java:1443)
	at org.apache.hadoop.hdfs.MiniDFSCluster.createNameNode(MiniDFSCluster.java:1104)
	at org.apache.hadoop.hdfs.MiniDFSCluster.createNameNodesAndSetConf(MiniDFSCluster.java:975)
	at org.apache.hadoop.hdfs.MiniDFSCluster.initMiniDFSCluster(MiniDFSCluster.java:804)
	at org.apache.hadoop.hdfs.MiniDFSCluster.<init>(MiniDFSCluster.java:465)
	at org.apache.hadoop.hdfs.MiniDFSCluster$Builder.build(MiniDFSCluster.java:424)
	at org.apache.hadoop.net.TestNetworkTopology.testInvalidNetworkTopologiesNotCachedInHdfs(TestNetworkTopology.java:320)


REGRESSION:  org.apache.hadoop.tracing.TestTracingShortCircuitLocalRead.testShortCircuitTraceHooks

Error Message:
Cannot lock storage /home/jenkins/jenkins-slave/workspace/Hadoop-Hdfs-trunk/hadoop-hdfs-project/hadoop-hdfs/target/test/data/dfs/name1. The directory is already locked

Stack Trace:
java.io.IOException: Cannot lock storage /home/jenkins/jenkins-slave/workspace/Hadoop-Hdfs-trunk/hadoop-hdfs-project/hadoop-hdfs/target/test/data/dfs/name1. The directory is already locked
	at org.apache.hadoop.hdfs.server.common.Storage$StorageDirectory.lock(Storage.java:683)
	at org.apache.hadoop.hdfs.server.common.Storage$StorageDirectory.analyzeStorage(Storage.java:499)
	at org.apache.hadoop.hdfs.server.namenode.FSImage.recoverStorageDirs(FSImage.java:308)
	at org.apache.hadoop.hdfs.server.namenode.FSImage.recoverTransitionRead(FSImage.java:202)
	at org.apache.hadoop.hdfs.server.namenode.FSNamesystem.loadFSImage(FSNamesystem.java:1010)
	at org.apache.hadoop.hdfs.server.namenode.FSNamesystem.loadFromDisk(FSNamesystem.java:717)
	at org.apache.hadoop.hdfs.server.namenode.NameNode.loadNamesystem(NameNode.java:537)
	at org.apache.hadoop.hdfs.server.namenode.NameNode.initialize(NameNode.java:596)
	at org.apache.hadoop.hdfs.server.namenode.NameNode.<init>(NameNode.java:763)
	at org.apache.hadoop.hdfs.server.namenode.NameNode.<init>(NameNode.java:747)
	at org.apache.hadoop.hdfs.server.namenode.NameNode.createNameNode(NameNode.java:1443)
	at org.apache.hadoop.hdfs.MiniDFSCluster.createNameNode(MiniDFSCluster.java:1104)
	at org.apache.hadoop.hdfs.MiniDFSCluster.createNameNodesAndSetConf(MiniDFSCluster.java:975)
	at org.apache.hadoop.hdfs.MiniDFSCluster.initMiniDFSCluster(MiniDFSCluster.java:804)
	at org.apache.hadoop.hdfs.MiniDFSCluster.<init>(MiniDFSCluster.java:465)
	at org.apache.hadoop.hdfs.MiniDFSCluster$Builder.build(MiniDFSCluster.java:424)
	at org.apache.hadoop.tracing.TestTracingShortCircuitLocalRead.testShortCircuitTraceHooks(TestTracingShortCircuitLocalRead.java:75)



Mime
  • Unnamed multipart/mixed (inline, None, 0 bytes)
View raw message