hadoop-hdfs-dev mailing list archives

Site index · List index
Message view « Date » · « Thread »
Top « Date » · « Thread »
From Apache Jenkins Server <jenk...@builds.apache.org>
Subject Build failed in Jenkins: Hadoop-Hdfs-trunk #1918
Date Fri, 31 Oct 2014 13:20:37 GMT
See <https://builds.apache.org/job/Hadoop-Hdfs-trunk/1918/changes>

Changes:

[jlowe] YARN-2755. NM fails to clean up usercache_DEL_<timestamp> dirs after YARN-661.
Contributed by Siqi Li

[cmccabe] HADOOP-11250. fix endmacro of set_find_shared_library_without_version in CMakeLists
(Yi Liu via Colin P. McCabe)

[jing9] HDFS-7230. Add rolling downgrade documentation. Contributed by Tsz Wo Nicholas Sze.

[szetszwo] HADOOP-11221. IdentityHashStore assumes System.identityHashCode() is non-negative.
Contributed by Jinghui Wang

[wang] HDFS-3342. SocketTimeoutException in BlockSender.sendChunks could have a better error
message. Contributed by Yongjun Zhang.

[brandonli] update CHANGES.txt to move HADOOP-11247 to 2.6

[stevel] YARN-2677 registry punycoding of usernames doesn't fix all usernames to be  DNS-valid
(stevel)

[cmccabe] HADOOP-10926. Improve test-patch.sh to apply binary diffs (cmccabe)

[cmccabe] HDFS-7035. Make adding a new data directory to the DataNode an atomic operation
and improve error handling (Lei Xu via Colin P. McCabe)

[cmccabe] HADOOP-10926: Improve test-patch.sh to apply binary diffs: fix typo

[cmccabe] Revert "HADOOP-10926. Improve test-patch.sh to apply binary diffs (cmccabe)

[cnauroth] HDFS-6385. Show when block deletion will start after NameNode startup in WebUI.
Contributed by Chris Nauroth.

[cnauroth] HDFS-7313. Support optional configuration of AES cipher suite on DataTransferProtocol.
Contributed by Chris Nauroth.

[vinodkv] YARN-2698. Moved some node label APIs to be correctly placed in client protocol.
Contributed by Wangda Tan.

[vinodkv] YARN-2779. Fixed ResourceManager to not require delegation tokens for communicating
with Timeline Service. Contributed by Zhijie Shen.

------------------------------------------
[...truncated 5703 lines...]
Running org.apache.hadoop.hdfs.server.namenode.TestNameNodeXAttr
Tests run: 13, Failures: 0, Errors: 0, Skipped: 0, Time elapsed: 9.663 sec - in org.apache.hadoop.hdfs.server.namenode.TestNameNodeXAttr
Running org.apache.hadoop.hdfs.server.namenode.TestPathComponents
Tests run: 1, Failures: 0, Errors: 0, Skipped: 0, Time elapsed: 0.171 sec - in org.apache.hadoop.hdfs.server.namenode.TestPathComponents
Running org.apache.hadoop.hdfs.server.namenode.TestFSDirectory
Tests run: 5, Failures: 0, Errors: 0, Skipped: 0, Time elapsed: 8.423 sec - in org.apache.hadoop.hdfs.server.namenode.TestFSDirectory
Running org.apache.hadoop.hdfs.server.namenode.TestFileLimit
Tests run: 4, Failures: 0, Errors: 0, Skipped: 0, Time elapsed: 5.865 sec - in org.apache.hadoop.hdfs.server.namenode.TestFileLimit
Running org.apache.hadoop.hdfs.server.namenode.TestMetaSave
Tests run: 3, Failures: 0, Errors: 0, Skipped: 0, Time elapsed: 34.025 sec - in org.apache.hadoop.hdfs.server.namenode.TestMetaSave
Running org.apache.hadoop.hdfs.server.namenode.TestEditLogAutoroll
Tests run: 1, Failures: 0, Errors: 0, Skipped: 0, Time elapsed: 4.7 sec - in org.apache.hadoop.hdfs.server.namenode.TestEditLogAutoroll
Running org.apache.hadoop.hdfs.server.namenode.TestFSNamesystemMBean
Tests run: 2, Failures: 0, Errors: 0, Skipped: 0, Time elapsed: 4.091 sec - in org.apache.hadoop.hdfs.server.namenode.TestFSNamesystemMBean
Running org.apache.hadoop.hdfs.server.namenode.TestCheckpoint
Tests run: 38, Failures: 0, Errors: 0, Skipped: 0, Time elapsed: 50.994 sec - in org.apache.hadoop.hdfs.server.namenode.TestCheckpoint
Running org.apache.hadoop.hdfs.server.namenode.TestNameNodeHttpServer
Tests run: 3, Failures: 0, Errors: 0, Skipped: 0, Time elapsed: 2.118 sec - in org.apache.hadoop.hdfs.server.namenode.TestNameNodeHttpServer
Running org.apache.hadoop.hdfs.server.namenode.TestNameNodeResourcePolicy
Tests run: 5, Failures: 0, Errors: 0, Skipped: 0, Time elapsed: 0.305 sec - in org.apache.hadoop.hdfs.server.namenode.TestNameNodeResourcePolicy
Running org.apache.hadoop.hdfs.server.namenode.TestSecurityTokenEditLog
Tests run: 2, Failures: 0, Errors: 0, Skipped: 0, Time elapsed: 16.044 sec - in org.apache.hadoop.hdfs.server.namenode.TestSecurityTokenEditLog
Running org.apache.hadoop.hdfs.server.namenode.TestFSImageWithAcl
Tests run: 4, Failures: 0, Errors: 0, Skipped: 0, Time elapsed: 64.056 sec - in org.apache.hadoop.hdfs.server.namenode.TestFSImageWithAcl
Running org.apache.hadoop.hdfs.server.namenode.TestGenericJournalConf
Tests run: 4, Failures: 0, Errors: 0, Skipped: 0, Time elapsed: 3.367 sec - in org.apache.hadoop.hdfs.server.namenode.TestGenericJournalConf
Running org.apache.hadoop.hdfs.server.namenode.TestAddBlock
Tests run: 2, Failures: 0, Errors: 0, Skipped: 0, Time elapsed: 16.197 sec - in org.apache.hadoop.hdfs.server.namenode.TestAddBlock
Running org.apache.hadoop.hdfs.server.namenode.TestAclConfigFlag
Tests run: 8, Failures: 0, Errors: 0, Skipped: 0, Time elapsed: 9.644 sec - in org.apache.hadoop.hdfs.server.namenode.TestAclConfigFlag
Running org.apache.hadoop.hdfs.server.namenode.TestAclTransformation
Tests run: 51, Failures: 0, Errors: 0, Skipped: 0, Time elapsed: 0.246 sec - in org.apache.hadoop.hdfs.server.namenode.TestAclTransformation
Running org.apache.hadoop.hdfs.server.namenode.TestFSImageWithXAttr
Tests run: 2, Failures: 0, Errors: 0, Skipped: 0, Time elapsed: 39.977 sec - in org.apache.hadoop.hdfs.server.namenode.TestFSImageWithXAttr
Running org.apache.hadoop.hdfs.server.namenode.TestCreateEditsLog
Tests run: 1, Failures: 0, Errors: 0, Skipped: 0, Time elapsed: 4.149 sec - in org.apache.hadoop.hdfs.server.namenode.TestCreateEditsLog
Running org.apache.hadoop.hdfs.server.namenode.TestDiskspaceQuotaUpdate
Tests run: 3, Failures: 0, Errors: 0, Skipped: 0, Time elapsed: 6.879 sec - in org.apache.hadoop.hdfs.server.namenode.TestDiskspaceQuotaUpdate
Running org.apache.hadoop.hdfs.server.namenode.TestSnapshotPathINodes
Tests run: 6, Failures: 0, Errors: 0, Skipped: 0, Time elapsed: 4.562 sec - in org.apache.hadoop.hdfs.server.namenode.TestSnapshotPathINodes
Running org.apache.hadoop.hdfs.server.namenode.TestFsLimits
Tests run: 8, Failures: 0, Errors: 0, Skipped: 0, Time elapsed: 1.928 sec - in org.apache.hadoop.hdfs.server.namenode.TestFsLimits
Running org.apache.hadoop.hdfs.server.namenode.TestNameNodeRetryCacheMetrics
Tests run: 1, Failures: 0, Errors: 0, Skipped: 0, Time elapsed: 6.996 sec - in org.apache.hadoop.hdfs.server.namenode.TestNameNodeRetryCacheMetrics
Running org.apache.hadoop.hdfs.server.namenode.TestStartup
Tests run: 9, Failures: 0, Errors: 0, Skipped: 0, Time elapsed: 23.901 sec - in org.apache.hadoop.hdfs.server.namenode.TestStartup
Running org.apache.hadoop.hdfs.server.namenode.TestListCorruptFileBlocks
Tests run: 5, Failures: 0, Errors: 0, Skipped: 0, Time elapsed: 24.906 sec - in org.apache.hadoop.hdfs.server.namenode.TestListCorruptFileBlocks
Running org.apache.hadoop.hdfs.server.namenode.TestHDFSConcat
Tests run: 4, Failures: 0, Errors: 0, Skipped: 0, Time elapsed: 13.327 sec - in org.apache.hadoop.hdfs.server.namenode.TestHDFSConcat
Running org.apache.hadoop.hdfs.server.namenode.TestSaveNamespace
Tests run: 13, Failures: 0, Errors: 0, Skipped: 0, Time elapsed: 6.743 sec - in org.apache.hadoop.hdfs.server.namenode.TestSaveNamespace
Running org.apache.hadoop.hdfs.server.namenode.TestEditLogJournalFailures
Tests run: 6, Failures: 0, Errors: 0, Skipped: 0, Time elapsed: 7.61 sec - in org.apache.hadoop.hdfs.server.namenode.TestEditLogJournalFailures
Running org.apache.hadoop.hdfs.server.namenode.TestBlockUnderConstruction
Tests run: 2, Failures: 0, Errors: 0, Skipped: 0, Time elapsed: 3.97 sec - in org.apache.hadoop.hdfs.server.namenode.TestBlockUnderConstruction
Running org.apache.hadoop.hdfs.server.namenode.TestCheckPointForSecurityTokens
Tests run: 1, Failures: 0, Errors: 0, Skipped: 0, Time elapsed: 6.175 sec - in org.apache.hadoop.hdfs.server.namenode.TestCheckPointForSecurityTokens
Running org.apache.hadoop.hdfs.server.namenode.ha.TestHAAppend
Tests run: 1, Failures: 0, Errors: 0, Skipped: 0, Time elapsed: 5.447 sec - in org.apache.hadoop.hdfs.server.namenode.ha.TestHAAppend
Running org.apache.hadoop.hdfs.server.namenode.ha.TestBootstrapStandby
Tests run: 5, Failures: 0, Errors: 0, Skipped: 0, Time elapsed: 6.919 sec - in org.apache.hadoop.hdfs.server.namenode.ha.TestBootstrapStandby
Running org.apache.hadoop.hdfs.server.namenode.ha.TestDNFencing
Tests run: 6, Failures: 0, Errors: 0, Skipped: 0, Time elapsed: 39.385 sec - in org.apache.hadoop.hdfs.server.namenode.ha.TestDNFencing
Running org.apache.hadoop.hdfs.server.namenode.ha.TestDNFencingWithReplication
Tests run: 1, Failures: 0, Errors: 0, Skipped: 0, Time elapsed: 57.987 sec - in org.apache.hadoop.hdfs.server.namenode.ha.TestDNFencingWithReplication
Running org.apache.hadoop.hdfs.server.namenode.ha.TestLossyRetryInvocationHandler
Tests run: 1, Failures: 0, Errors: 0, Skipped: 0, Time elapsed: 3.576 sec - in org.apache.hadoop.hdfs.server.namenode.ha.TestLossyRetryInvocationHandler
Running org.apache.hadoop.hdfs.server.namenode.ha.TestStandbyIsHot
Tests run: 2, Failures: 0, Errors: 0, Skipped: 0, Time elapsed: 16.299 sec - in org.apache.hadoop.hdfs.server.namenode.ha.TestStandbyIsHot
Running org.apache.hadoop.hdfs.server.namenode.ha.TestHarFileSystemWithHA
Tests run: 1, Failures: 0, Errors: 0, Skipped: 0, Time elapsed: 4.202 sec - in org.apache.hadoop.hdfs.server.namenode.ha.TestHarFileSystemWithHA
Running org.apache.hadoop.hdfs.server.namenode.ha.TestFailureOfSharedDir
Tests run: 4, Failures: 0, Errors: 0, Skipped: 0, Time elapsed: 7.734 sec - in org.apache.hadoop.hdfs.server.namenode.ha.TestFailureOfSharedDir
Running org.apache.hadoop.hdfs.server.namenode.ha.TestHAMetrics
Tests run: 1, Failures: 0, Errors: 0, Skipped: 0, Time elapsed: 7.322 sec - in org.apache.hadoop.hdfs.server.namenode.ha.TestHAMetrics
Running org.apache.hadoop.hdfs.server.namenode.ha.TestHASafeMode
Tests run: 18, Failures: 0, Errors: 0, Skipped: 0, Time elapsed: 70.574 sec - in org.apache.hadoop.hdfs.server.namenode.ha.TestHASafeMode
Running org.apache.hadoop.hdfs.server.namenode.ha.TestDelegationTokensWithHA
Tests run: 7, Failures: 0, Errors: 0, Skipped: 0, Time elapsed: 9.117 sec - in org.apache.hadoop.hdfs.server.namenode.ha.TestDelegationTokensWithHA
Running org.apache.hadoop.hdfs.server.namenode.ha.TestStateTransitionFailure
Tests run: 1, Failures: 0, Errors: 0, Skipped: 0, Time elapsed: 3.538 sec - in org.apache.hadoop.hdfs.server.namenode.ha.TestStateTransitionFailure
Running org.apache.hadoop.hdfs.server.namenode.ha.TestEditLogsDuringFailover
Tests run: 3, Failures: 0, Errors: 0, Skipped: 0, Time elapsed: 6.053 sec - in org.apache.hadoop.hdfs.server.namenode.ha.TestEditLogsDuringFailover
Running org.apache.hadoop.hdfs.server.namenode.ha.TestHAFsck
Tests run: 1, Failures: 0, Errors: 0, Skipped: 0, Time elapsed: 4.23 sec - in org.apache.hadoop.hdfs.server.namenode.ha.TestHAFsck
Running org.apache.hadoop.hdfs.server.namenode.ha.TestRetryCacheWithHA
Tests run: 22, Failures: 0, Errors: 0, Skipped: 0, Time elapsed: 78.605 sec - in org.apache.hadoop.hdfs.server.namenode.ha.TestRetryCacheWithHA
Running org.apache.hadoop.hdfs.server.namenode.ha.TestPendingCorruptDnMessages
Tests run: 1, Failures: 0, Errors: 0, Skipped: 0, Time elapsed: 12.761 sec - in org.apache.hadoop.hdfs.server.namenode.ha.TestPendingCorruptDnMessages
Running org.apache.hadoop.hdfs.server.namenode.ha.TestStandbyCheckpoints
Tests run: 7, Failures: 0, Errors: 0, Skipped: 0, Time elapsed: 74.758 sec - in org.apache.hadoop.hdfs.server.namenode.ha.TestStandbyCheckpoints
Running org.apache.hadoop.hdfs.server.namenode.ha.TestFailoverWithBlockTokensEnabled
Tests run: 4, Failures: 0, Errors: 0, Skipped: 0, Time elapsed: 17.163 sec - in org.apache.hadoop.hdfs.server.namenode.ha.TestFailoverWithBlockTokensEnabled
Running org.apache.hadoop.hdfs.server.namenode.ha.TestInitializeSharedEdits
Tests run: 4, Failures: 0, Errors: 0, Skipped: 0, Time elapsed: 10.584 sec - in org.apache.hadoop.hdfs.server.namenode.ha.TestInitializeSharedEdits
Running org.apache.hadoop.hdfs.server.namenode.ha.TestDFSUpgradeWithHA
Tests run: 9, Failures: 0, Errors: 0, Skipped: 0, Time elapsed: 17.424 sec - in org.apache.hadoop.hdfs.server.namenode.ha.TestDFSUpgradeWithHA
Running org.apache.hadoop.hdfs.server.namenode.ha.TestFailureToReadEdits
Tests run: 6, Failures: 0, Errors: 0, Skipped: 0, Time elapsed: 83.466 sec - in org.apache.hadoop.hdfs.server.namenode.ha.TestFailureToReadEdits
Running org.apache.hadoop.hdfs.server.namenode.ha.TestHAStateTransitions
Tests run: 11, Failures: 0, Errors: 0, Skipped: 0, Time elapsed: 60.926 sec - in org.apache.hadoop.hdfs.server.namenode.ha.TestHAStateTransitions
Running org.apache.hadoop.hdfs.server.namenode.ha.TestXAttrsWithHA
Tests run: 1, Failures: 0, Errors: 0, Skipped: 0, Time elapsed: 4.665 sec - in org.apache.hadoop.hdfs.server.namenode.ha.TestXAttrsWithHA
Running org.apache.hadoop.hdfs.server.namenode.ha.TestNNHealthCheck
Tests run: 1, Failures: 0, Errors: 0, Skipped: 0, Time elapsed: 3.421 sec - in org.apache.hadoop.hdfs.server.namenode.ha.TestNNHealthCheck
Running org.apache.hadoop.hdfs.server.namenode.ha.TestDFSZKFailoverController
Tests run: 3, Failures: 0, Errors: 0, Skipped: 0, Time elapsed: 25.343 sec - in org.apache.hadoop.hdfs.server.namenode.ha.TestDFSZKFailoverController
Running org.apache.hadoop.hdfs.server.namenode.ha.TestPipelinesFailover
Tests run: 8, Failures: 0, Errors: 0, Skipped: 0, Time elapsed: 87.398 sec - in org.apache.hadoop.hdfs.server.namenode.ha.TestPipelinesFailover
Running org.apache.hadoop.hdfs.server.namenode.ha.TestGetGroupsWithHA
Tests run: 6, Failures: 0, Errors: 0, Skipped: 0, Time elapsed: 6.057 sec - in org.apache.hadoop.hdfs.server.namenode.ha.TestGetGroupsWithHA
Running org.apache.hadoop.hdfs.server.namenode.ha.TestHAConfiguration
Tests run: 4, Failures: 0, Errors: 0, Skipped: 0, Time elapsed: 1.473 sec - in org.apache.hadoop.hdfs.server.namenode.ha.TestHAConfiguration
Running org.apache.hadoop.hdfs.server.namenode.ha.TestEditLogTailer
Tests run: 3, Failures: 0, Errors: 0, Skipped: 0, Time elapsed: 7.821 sec - in org.apache.hadoop.hdfs.server.namenode.ha.TestEditLogTailer
Running org.apache.hadoop.hdfs.server.namenode.ha.TestStandbyBlockManagement
Tests run: 1, Failures: 0, Errors: 0, Skipped: 0, Time elapsed: 6.611 sec - in org.apache.hadoop.hdfs.server.namenode.ha.TestStandbyBlockManagement
Running org.apache.hadoop.hdfs.server.namenode.ha.TestQuotasWithHA
Tests run: 1, Failures: 0, Errors: 0, Skipped: 0, Time elapsed: 6.884 sec - in org.apache.hadoop.hdfs.server.namenode.ha.TestQuotasWithHA
Running org.apache.hadoop.hdfs.server.namenode.ha.TestBootstrapStandbyWithQJM
Tests run: 2, Failures: 0, Errors: 0, Skipped: 0, Time elapsed: 6.837 sec - in org.apache.hadoop.hdfs.server.namenode.ha.TestBootstrapStandbyWithQJM
Running org.apache.hadoop.hdfs.server.namenode.TestAuditLogs
Tests run: 14, Failures: 0, Errors: 0, Skipped: 0, Time elapsed: 25.258 sec - in org.apache.hadoop.hdfs.server.namenode.TestAuditLogs
Running org.apache.hadoop.hdfs.server.namenode.TestBackupNode
Tests run: 4, Failures: 0, Errors: 0, Skipped: 0, Time elapsed: 18.866 sec - in org.apache.hadoop.hdfs.server.namenode.TestBackupNode
Running org.apache.hadoop.hdfs.server.namenode.TestAuditLogger
Tests run: 4, Failures: 0, Errors: 0, Skipped: 0, Time elapsed: 6.206 sec - in org.apache.hadoop.hdfs.server.namenode.TestAuditLogger
Running org.apache.hadoop.hdfs.server.namenode.TestDeleteRace
Tests run: 5, Failures: 0, Errors: 0, Skipped: 0, Time elapsed: 45.741 sec - in org.apache.hadoop.hdfs.server.namenode.TestDeleteRace
Running org.apache.hadoop.hdfs.server.namenode.TestStartupProgressServlet
Tests run: 3, Failures: 0, Errors: 0, Skipped: 0, Time elapsed: 0.524 sec - in org.apache.hadoop.hdfs.server.namenode.TestStartupProgressServlet
Running org.apache.hadoop.hdfs.server.namenode.TestEditLogFileInputStream
Tests run: 1, Failures: 0, Errors: 0, Skipped: 0, Time elapsed: 0.966 sec - in org.apache.hadoop.hdfs.server.namenode.TestEditLogFileInputStream
Running org.apache.hadoop.hdfs.server.namenode.TestNameNodeOptionParsing
Tests run: 2, Failures: 0, Errors: 0, Skipped: 0, Time elapsed: 0.553 sec - in org.apache.hadoop.hdfs.server.namenode.TestNameNodeOptionParsing
Running org.apache.hadoop.hdfs.server.namenode.TestLargeDirectoryDelete
Tests run: 1, Failures: 0, Errors: 0, Skipped: 0, Time elapsed: 43.694 sec - in org.apache.hadoop.hdfs.server.namenode.TestLargeDirectoryDelete
Running org.apache.hadoop.hdfs.server.namenode.TestSecureNameNode
Tests run: 1, Failures: 0, Errors: 0, Skipped: 1, Time elapsed: 0.079 sec - in org.apache.hadoop.hdfs.server.namenode.TestSecureNameNode
Running org.apache.hadoop.hdfs.server.mover.TestStorageMover
Tests run: 6, Failures: 0, Errors: 0, Skipped: 0, Time elapsed: 205.075 sec - in org.apache.hadoop.hdfs.server.mover.TestStorageMover
Running org.apache.hadoop.hdfs.server.mover.TestMover
Tests run: 5, Failures: 0, Errors: 0, Skipped: 0, Time elapsed: 8.283 sec - in org.apache.hadoop.hdfs.server.mover.TestMover
Running org.apache.hadoop.hdfs.TestInjectionForSimulatedStorage
Tests run: 1, Failures: 0, Errors: 0, Skipped: 0, Time elapsed: 14.122 sec - in org.apache.hadoop.hdfs.TestInjectionForSimulatedStorage
Running org.apache.hadoop.hdfs.TestLeaseRecovery
Tests run: 2, Failures: 0, Errors: 0, Skipped: 0, Time elapsed: 17.975 sec - in org.apache.hadoop.hdfs.TestLeaseRecovery
Running org.apache.hadoop.hdfs.TestRestartDFS
Tests run: 2, Failures: 0, Errors: 0, Skipped: 0, Time elapsed: 10.673 sec - in org.apache.hadoop.hdfs.TestRestartDFS
Running org.apache.hadoop.hdfs.TestDFSUpgradeFromImage
Tests run: 7, Failures: 0, Errors: 0, Skipped: 0, Time elapsed: 11.848 sec - in org.apache.hadoop.hdfs.TestDFSUpgradeFromImage
Running org.apache.hadoop.hdfs.TestPread

Results :

Tests run: 1997, Failures: 0, Errors: 0, Skipped: 8

[INFO]                                                                         
[INFO] ------------------------------------------------------------------------
[INFO] Skipping Apache Hadoop HttpFS
[INFO] This project has been banned from the build due to previous failures.
[INFO] ------------------------------------------------------------------------
[INFO]                                                                         
[INFO] ------------------------------------------------------------------------
[INFO] Skipping Apache Hadoop HDFS BookKeeper Journal
[INFO] This project has been banned from the build due to previous failures.
[INFO] ------------------------------------------------------------------------
[INFO]                                                                         
[INFO] ------------------------------------------------------------------------
[INFO] Skipping Apache Hadoop HDFS-NFS
[INFO] This project has been banned from the build due to previous failures.
[INFO] ------------------------------------------------------------------------
[INFO]                                                                         
[INFO] ------------------------------------------------------------------------
[INFO] Building Apache Hadoop HDFS Project 3.0.0-SNAPSHOT
[INFO] ------------------------------------------------------------------------
[WARNING] The POM for org.eclipse.m2e:lifecycle-mapping:jar:1.0.0 is missing, no dependency
information available
[WARNING] Failed to retrieve plugin descriptor for org.eclipse.m2e:lifecycle-mapping:1.0.0:
Plugin org.eclipse.m2e:lifecycle-mapping:1.0.0 or one of its dependencies could not be resolved:
Failure to find org.eclipse.m2e:lifecycle-mapping:jar:1.0.0 in http://repo.maven.apache.org/maven2
was cached in the local repository, resolution will not be reattempted until the update interval
of central has elapsed or updates are forced
[INFO] 
[INFO] --- maven-clean-plugin:2.4.1:clean (default-clean) @ hadoop-hdfs-project ---
[INFO] Deleting <https://builds.apache.org/job/Hadoop-Hdfs-trunk/ws/hadoop-hdfs-project/target>
[INFO] 
[INFO] --- maven-antrun-plugin:1.7:run (create-testdirs) @ hadoop-hdfs-project ---
[INFO] Executing tasks

main:
    [mkdir] Created dir: <https://builds.apache.org/job/Hadoop-Hdfs-trunk/ws/hadoop-hdfs-project/target/test-dir>
[INFO] Executed tasks
[INFO] 
[INFO] --- maven-source-plugin:2.1.2:jar-no-fork (hadoop-java-sources) @ hadoop-hdfs-project
---
[INFO] 
[INFO] --- maven-source-plugin:2.1.2:test-jar-no-fork (hadoop-java-sources) @ hadoop-hdfs-project
---
[INFO] 
[INFO] --- maven-enforcer-plugin:1.3.1:enforce (dist-enforce) @ hadoop-hdfs-project ---
[INFO] 
[INFO] --- maven-site-plugin:3.3:attach-descriptor (attach-descriptor) @ hadoop-hdfs-project
---
[INFO] 
[INFO] --- maven-javadoc-plugin:2.8.1:jar (module-javadocs) @ hadoop-hdfs-project ---
[INFO] Not executing Javadoc as the project is not a Java classpath-capable package
[INFO] 
[INFO] --- maven-enforcer-plugin:1.3.1:enforce (depcheck) @ hadoop-hdfs-project ---
[INFO] 
[INFO] --- maven-checkstyle-plugin:2.6:checkstyle (default-cli) @ hadoop-hdfs-project ---
[INFO] 
[INFO] --- findbugs-maven-plugin:2.3.2:findbugs (default-cli) @ hadoop-hdfs-project ---
[INFO] ****** FindBugsMojo execute *******
[INFO] canGenerate is false
[INFO] ------------------------------------------------------------------------
[INFO] Reactor Summary:
[INFO] 
[INFO] Apache Hadoop HDFS ................................ FAILURE [  01:44 h]
[INFO] Apache Hadoop HttpFS .............................. SKIPPED
[INFO] Apache Hadoop HDFS BookKeeper Journal ............. SKIPPED
[INFO] Apache Hadoop HDFS-NFS ............................ SKIPPED
[INFO] Apache Hadoop HDFS Project ........................ SUCCESS [  2.186 s]
[INFO] ------------------------------------------------------------------------
[INFO] BUILD FAILURE
[INFO] ------------------------------------------------------------------------
[INFO] Total time: 01:44 h
[INFO] Finished at: 2014-10-31T13:19:06+00:00
[INFO] Final Memory: 78M/987M
[INFO] ------------------------------------------------------------------------
[ERROR] Failed to execute goal org.apache.maven.plugins:maven-surefire-plugin:2.16:test (default-test)
on project hadoop-hdfs: ExecutionException; nested exception is java.util.concurrent.ExecutionException:
java.lang.RuntimeException: The forked VM terminated without saying properly goodbye. VM crash
or System.exit called ?
[ERROR] Command was/bin/sh -c cd <https://builds.apache.org/job/Hadoop-Hdfs-trunk/ws/hadoop-hdfs-project/hadoop-hdfs>
&& /home/jenkins/tools/java/jdk1.6.0_45-64/jre/bin/java -Xmx1024m -XX:+HeapDumpOnOutOfMemoryError
-jar <https://builds.apache.org/job/Hadoop-Hdfs-trunk/ws/hadoop-hdfs-project/hadoop-hdfs/target/surefire/surefirebooter8022758525499641150.jar>
<https://builds.apache.org/job/Hadoop-Hdfs-trunk/ws/hadoop-hdfs-project/hadoop-hdfs/target/surefire/surefire5405515521050350270tmp>
<https://builds.apache.org/job/Hadoop-Hdfs-trunk/ws/hadoop-hdfs-project/hadoop-hdfs/target/surefire/surefire_1239062400758723018178tmp>
[ERROR] -> [Help 1]
[ERROR] 
[ERROR] To see the full stack trace of the errors, re-run Maven with the -e switch.
[ERROR] Re-run Maven using the -X switch to enable full debug logging.
[ERROR] 
[ERROR] For more information about the errors and possible solutions, please read the following
articles:
[ERROR] [Help 1] http://cwiki.apache.org/confluence/display/MAVEN/MojoFailureException
Build step 'Execute shell' marked build as failure
Archiving artifacts
Recording test results
Updating HADOOP-11250
Updating YARN-661
Updating YARN-2779
Updating HDFS-7035
Updating HDFS-3342
Updating HADOOP-11247
Updating HADOOP-11221
Updating HDFS-6385
Updating HADOOP-10926
Updating YARN-2698
Updating HDFS-7230
Updating HDFS-7313
Updating YARN-2677
Updating YARN-2755

Mime
View raw message