hadoop-hdfs-dev mailing list archives

Site index · List index
Message view « Date » · « Thread »
Top « Date » · « Thread »
From Apache Jenkins Server <jenk...@builds.apache.org>
Subject Hadoop-Hdfs-trunk - Build # 1898 - Still Failing
Date Sat, 11 Oct 2014 13:58:07 GMT
See https://builds.apache.org/job/Hadoop-Hdfs-trunk/1898/

###################################################################################
########################## LAST 60 LINES OF THE CONSOLE ###########################
[...truncated 6202 lines...]
[INFO] Executed tasks
[INFO] 
[INFO] --- maven-source-plugin:2.1.2:jar-no-fork (hadoop-java-sources) @ hadoop-hdfs-project
---
[INFO] 
[INFO] --- maven-source-plugin:2.1.2:test-jar-no-fork (hadoop-java-sources) @ hadoop-hdfs-project
---
[INFO] 
[INFO] --- maven-enforcer-plugin:1.3.1:enforce (dist-enforce) @ hadoop-hdfs-project ---
[INFO] 
[INFO] --- maven-site-plugin:3.3:attach-descriptor (attach-descriptor) @ hadoop-hdfs-project
---
[INFO] 
[INFO] --- maven-javadoc-plugin:2.8.1:jar (module-javadocs) @ hadoop-hdfs-project ---
[INFO] Not executing Javadoc as the project is not a Java classpath-capable package
[INFO] 
[INFO] --- maven-enforcer-plugin:1.3.1:enforce (depcheck) @ hadoop-hdfs-project ---
[INFO] 
[INFO] --- maven-checkstyle-plugin:2.6:checkstyle (default-cli) @ hadoop-hdfs-project ---
[INFO] 
[INFO] --- findbugs-maven-plugin:2.3.2:findbugs (default-cli) @ hadoop-hdfs-project ---
[INFO] ****** FindBugsMojo execute *******
[INFO] canGenerate is false
[INFO] ------------------------------------------------------------------------
[INFO] Reactor Summary:
[INFO] 
[INFO] Apache Hadoop HDFS ................................ FAILURE [  02:22 h]
[INFO] Apache Hadoop HttpFS .............................. SKIPPED
[INFO] Apache Hadoop HDFS BookKeeper Journal ............. SKIPPED
[INFO] Apache Hadoop HDFS-NFS ............................ SKIPPED
[INFO] Apache Hadoop HDFS Project ........................ SUCCESS [  2.191 s]
[INFO] ------------------------------------------------------------------------
[INFO] BUILD FAILURE
[INFO] ------------------------------------------------------------------------
[INFO] Total time: 02:22 h
[INFO] Finished at: 2014-10-11T13:57:38+00:00
[INFO] Final Memory: 66M/877M
[INFO] ------------------------------------------------------------------------
[ERROR] Failed to execute goal org.apache.maven.plugins:maven-surefire-plugin:2.16:test (default-test)
on project hadoop-hdfs: There are test failures.
[ERROR] 
[ERROR] Please refer to /home/jenkins/jenkins-slave/workspace/Hadoop-Hdfs-trunk/hadoop-hdfs-project/hadoop-hdfs/target/surefire-reports
for the individual test results.
[ERROR] -> [Help 1]
[ERROR] 
[ERROR] To see the full stack trace of the errors, re-run Maven with the -e switch.
[ERROR] Re-run Maven using the -X switch to enable full debug logging.
[ERROR] 
[ERROR] For more information about the errors and possible solutions, please read the following
articles:
[ERROR] [Help 1] http://cwiki.apache.org/confluence/display/MAVEN/MojoFailureException
Build step 'Execute shell' marked build as failure
Archiving artifacts
Recording test results
Updating HDFS-6252
Updating HADOOP-11193
Updating YARN-2501
Updating HDFS-7198
Updating YARN-2494
Updating HADOOP-11188
Updating HDFS-7209
Updating HDFS-6657
Sending e-mails to: hdfs-dev@hadoop.apache.org
Email was triggered for: Failure
Sending email for trigger: Failure



###################################################################################
############################## FAILED TESTS (if any) ##############################
3 tests failed.
FAILED:  org.apache.hadoop.hdfs.server.namenode.ha.TestDNFencing.testQueueingWithAppend

Error Message:
expected:<18> but was:<12>

Stack Trace:
java.lang.AssertionError: expected:<18> but was:<12>
	at org.junit.Assert.fail(Assert.java:88)
	at org.junit.Assert.failNotEquals(Assert.java:743)
	at org.junit.Assert.assertEquals(Assert.java:118)
	at org.junit.Assert.assertEquals(Assert.java:555)
	at org.junit.Assert.assertEquals(Assert.java:542)
	at org.apache.hadoop.hdfs.server.namenode.ha.TestDNFencing.testQueueingWithAppend(TestDNFencing.java:448)


FAILED:  org.apache.hadoop.hdfs.server.namenode.snapshot.TestOpenFilesWithSnapshot.testOpenFilesWithMultipleSnapshots

Error Message:
Timed out waiting for Mini HDFS Cluster to start

Stack Trace:
java.io.IOException: Timed out waiting for Mini HDFS Cluster to start
	at org.apache.hadoop.hdfs.MiniDFSCluster.waitClusterUp(MiniDFSCluster.java:1194)
	at org.apache.hadoop.hdfs.MiniDFSCluster.restartNameNode(MiniDFSCluster.java:1819)
	at org.apache.hadoop.hdfs.MiniDFSCluster.restartNameNode(MiniDFSCluster.java:1789)
	at org.apache.hadoop.hdfs.server.namenode.snapshot.TestOpenFilesWithSnapshot.doTestMultipleSnapshots(TestOpenFilesWithSnapshot.java:184)
	at org.apache.hadoop.hdfs.server.namenode.snapshot.TestOpenFilesWithSnapshot.testOpenFilesWithMultipleSnapshots(TestOpenFilesWithSnapshot.java:162)


FAILED:  org.apache.hadoop.hdfs.server.namenode.ha.TestDNFencingWithReplication.testFencingStress

Error Message:
Deferred

Stack Trace:
java.lang.RuntimeException: Deferred
	at org.apache.hadoop.test.MultithreadedTestUtil$TestContext.checkException(MultithreadedTestUtil.java:130)
	at org.apache.hadoop.test.MultithreadedTestUtil$TestContext.stop(MultithreadedTestUtil.java:166)
	at org.apache.hadoop.hdfs.server.namenode.ha.TestDNFencingWithReplication.testFencingStress(TestDNFencingWithReplication.java:135)
Caused by: java.io.IOException: Timed out waiting for 2 replicas on path /test-15
	at org.apache.hadoop.hdfs.server.namenode.ha.TestDNFencingWithReplication$ReplicationToggler.waitForReplicas(TestDNFencingWithReplication.java:96)
	at org.apache.hadoop.hdfs.server.namenode.ha.TestDNFencingWithReplication$ReplicationToggler.doAnAction(TestDNFencingWithReplication.java:78)
	at org.apache.hadoop.test.MultithreadedTestUtil$RepeatingTestThread.doWork(MultithreadedTestUtil.java:222)
	at org.apache.hadoop.test.MultithreadedTestUtil$TestingThread.run(MultithreadedTestUtil.java:189)



Mime
  • Unnamed multipart/mixed (inline, None, 0 bytes)
View raw message