hadoop-hdfs-dev mailing list archives

Site index · List index
Message view « Date » · « Thread »
Top « Date » · « Thread »
From Apache Jenkins Server <jenk...@builds.apache.org>
Subject Build failed in Jenkins: Hadoop-Hdfs-trunk #1861
Date Thu, 04 Sep 2014 13:43:57 GMT
See <https://builds.apache.org/job/Hadoop-Hdfs-trunk/1861/changes>

Changes:

[umamahesh] HDFS-2975. Rename with overwrite flag true can make NameNode to stuck in safemode
on NN (crash + restart). (Yi Liu via umamahesh)

[kasha] HADOOP-10956. Fix create-release script to include docs and necessary txt files. (kasha)

[kasha] YARN-2394. FairScheduler: Configure fairSharePreemptionThreshold per queue. (Wei Yan
via kasha)

[tucu] HADOOP-10863. KMS should have a blacklist for decrypting EEKs. (asuresh via tucu)

[cdouglas] MAPREDUCE-6063. Correct spill size calculation for spills wrapping the circular
buffer. Contributed by zhihai xu.

[arp] HDFS-6848. Lack of synchronization on access to datanodeUuid in DataStorage#format.
(Contributed by Xiaoyu Yao)

[cmccabe] HDFS-6959 Make the HDFS home directory location customizable.  Contributed by Yongjun
Zhang

[cmccabe] HADOOP-11056. OsSecureRandom.setConf() might leak file descriptors.  Contributed
by Yongjun Zhang.

------------------------------------------
[...truncated 5311 lines...]
Tests run: 62, Failures: 0, Errors: 0, Skipped: 1, Time elapsed: 9.287 sec - in org.apache.hadoop.hdfs.web.TestWebHDFSAcl
Running org.apache.hadoop.hdfs.web.TestWebHdfsFileSystemContract
Tests run: 52, Failures: 0, Errors: 0, Skipped: 0, Time elapsed: 23.836 sec - in org.apache.hadoop.hdfs.web.TestWebHdfsFileSystemContract
Running org.apache.hadoop.hdfs.web.TestWebHdfsUrl
Tests run: 6, Failures: 0, Errors: 0, Skipped: 0, Time elapsed: 1.698 sec - in org.apache.hadoop.hdfs.web.TestWebHdfsUrl
Running org.apache.hadoop.hdfs.web.TestWebHdfsTimeouts
Tests run: 8, Failures: 0, Errors: 0, Skipped: 0, Time elapsed: 1.226 sec - in org.apache.hadoop.hdfs.web.TestWebHdfsTimeouts
Running org.apache.hadoop.hdfs.web.TestWebHDFSForHA
Tests run: 5, Failures: 0, Errors: 0, Skipped: 0, Time elapsed: 11.29 sec - in org.apache.hadoop.hdfs.web.TestWebHDFSForHA
Running org.apache.hadoop.hdfs.web.TestWebHdfsTokens
Tests run: 10, Failures: 0, Errors: 0, Skipped: 0, Time elapsed: 7.274 sec - in org.apache.hadoop.hdfs.web.TestWebHdfsTokens
Running org.apache.hadoop.hdfs.web.TestOffsetUrlInputStream
Tests run: 1, Failures: 0, Errors: 0, Skipped: 0, Time elapsed: 0.173 sec - in org.apache.hadoop.hdfs.web.TestOffsetUrlInputStream
Running org.apache.hadoop.hdfs.web.TestWebHDFS
Tests run: 10, Failures: 0, Errors: 0, Skipped: 0, Time elapsed: 100.195 sec - in org.apache.hadoop.hdfs.web.TestWebHDFS
Running org.apache.hadoop.hdfs.web.TestHttpsFileSystem
Tests run: 1, Failures: 0, Errors: 0, Skipped: 0, Time elapsed: 4.982 sec - in org.apache.hadoop.hdfs.web.TestHttpsFileSystem
Running org.apache.hadoop.hdfs.web.TestWebHdfsContentLength
Tests run: 7, Failures: 0, Errors: 0, Skipped: 0, Time elapsed: 1.042 sec - in org.apache.hadoop.hdfs.web.TestWebHdfsContentLength
Running org.apache.hadoop.hdfs.web.TestWebHDFSXAttr
Tests run: 11, Failures: 0, Errors: 0, Skipped: 0, Time elapsed: 10.812 sec - in org.apache.hadoop.hdfs.web.TestWebHDFSXAttr
Running org.apache.hadoop.hdfs.web.TestWebHdfsWithAuthenticationFilter
Tests run: 1, Failures: 0, Errors: 0, Skipped: 0, Time elapsed: 4.325 sec - in org.apache.hadoop.hdfs.web.TestWebHdfsWithAuthenticationFilter
Running org.apache.hadoop.hdfs.web.TestByteRangeInputStream
Tests run: 2, Failures: 0, Errors: 0, Skipped: 0, Time elapsed: 0.349 sec - in org.apache.hadoop.hdfs.web.TestByteRangeInputStream
Running org.apache.hadoop.hdfs.web.TestURLConnectionFactory
Tests run: 1, Failures: 0, Errors: 0, Skipped: 0, Time elapsed: 0.162 sec - in org.apache.hadoop.hdfs.web.TestURLConnectionFactory
Running org.apache.hadoop.hdfs.web.TestAuthFilter
Tests run: 3, Failures: 0, Errors: 0, Skipped: 0, Time elapsed: 0.562 sec - in org.apache.hadoop.hdfs.web.TestAuthFilter
Running org.apache.hadoop.hdfs.web.TestTokenAspect
Tests run: 6, Failures: 0, Errors: 0, Skipped: 0, Time elapsed: 1.196 sec - in org.apache.hadoop.hdfs.web.TestTokenAspect
Running org.apache.hadoop.hdfs.TestDFSClientFailover
Tests run: 8, Failures: 0, Errors: 0, Skipped: 2, Time elapsed: 10.326 sec - in org.apache.hadoop.hdfs.TestDFSClientFailover
Running org.apache.hadoop.hdfs.TestAbandonBlock
Tests run: 2, Failures: 0, Errors: 0, Skipped: 0, Time elapsed: 9.887 sec - in org.apache.hadoop.hdfs.TestAbandonBlock
Running org.apache.hadoop.hdfs.tools.TestGetGroups
Tests run: 6, Failures: 0, Errors: 0, Skipped: 0, Time elapsed: 4.322 sec - in org.apache.hadoop.hdfs.tools.TestGetGroups
Running org.apache.hadoop.hdfs.tools.TestDFSAdminWithHA
Tests run: 10, Failures: 0, Errors: 0, Skipped: 0, Time elapsed: 16.674 sec - in org.apache.hadoop.hdfs.tools.TestDFSAdminWithHA
Running org.apache.hadoop.hdfs.tools.offlineImageViewer.TestOfflineImageViewerForAcl
Tests run: 1, Failures: 0, Errors: 0, Skipped: 0, Time elapsed: 3.704 sec - in org.apache.hadoop.hdfs.tools.offlineImageViewer.TestOfflineImageViewerForAcl
Running org.apache.hadoop.hdfs.tools.offlineImageViewer.TestOfflineImageViewer
Tests run: 5, Failures: 0, Errors: 0, Skipped: 0, Time elapsed: 4.188 sec - in org.apache.hadoop.hdfs.tools.offlineImageViewer.TestOfflineImageViewer
Running org.apache.hadoop.hdfs.tools.TestGetConf
Tests run: 9, Failures: 0, Errors: 0, Skipped: 0, Time elapsed: 1.067 sec - in org.apache.hadoop.hdfs.tools.TestGetConf
Running org.apache.hadoop.hdfs.tools.offlineEditsViewer.TestOfflineEditsViewer
Tests run: 3, Failures: 0, Errors: 0, Skipped: 0, Time elapsed: 10.955 sec - in org.apache.hadoop.hdfs.tools.offlineEditsViewer.TestOfflineEditsViewer
Running org.apache.hadoop.hdfs.tools.TestDelegationTokenFetcher
Tests run: 2, Failures: 0, Errors: 0, Skipped: 0, Time elapsed: 1.023 sec - in org.apache.hadoop.hdfs.tools.TestDelegationTokenFetcher
Running org.apache.hadoop.hdfs.tools.TestDFSHAAdmin
Tests run: 20, Failures: 0, Errors: 0, Skipped: 0, Time elapsed: 1.996 sec - in org.apache.hadoop.hdfs.tools.TestDFSHAAdmin
Running org.apache.hadoop.hdfs.tools.TestDFSHAAdminMiniCluster
Tests run: 6, Failures: 0, Errors: 0, Skipped: 0, Time elapsed: 6.222 sec - in org.apache.hadoop.hdfs.tools.TestDFSHAAdminMiniCluster
Running org.apache.hadoop.hdfs.TestModTime
Tests run: 2, Failures: 0, Errors: 0, Skipped: 0, Time elapsed: 11.088 sec - in org.apache.hadoop.hdfs.TestModTime
Running org.apache.hadoop.hdfs.TestFileAppend4
Tests run: 4, Failures: 0, Errors: 0, Skipped: 0, Time elapsed: 28.537 sec - in org.apache.hadoop.hdfs.TestFileAppend4
Running org.apache.hadoop.hdfs.TestWriteRead
Tests run: 3, Failures: 0, Errors: 0, Skipped: 0, Time elapsed: 22.139 sec - in org.apache.hadoop.hdfs.TestWriteRead
Running org.apache.hadoop.hdfs.TestMultiThreadedHflush
Tests run: 3, Failures: 0, Errors: 0, Skipped: 0, Time elapsed: 7.297 sec - in org.apache.hadoop.hdfs.TestMultiThreadedHflush
Running org.apache.hadoop.net.TestNetworkTopology
Tests run: 10, Failures: 0, Errors: 0, Skipped: 0, Time elapsed: 9.388 sec - in org.apache.hadoop.net.TestNetworkTopology
Running org.apache.hadoop.TestRefreshCallQueue
Tests run: 1, Failures: 0, Errors: 0, Skipped: 0, Time elapsed: 3.247 sec - in org.apache.hadoop.TestRefreshCallQueue
Running org.apache.hadoop.TestGenericRefresh
Tests run: 9, Failures: 0, Errors: 0, Skipped: 0, Time elapsed: 3.38 sec - in org.apache.hadoop.TestGenericRefresh
Running org.apache.hadoop.cli.TestHDFSCLI
Tests run: 1, Failures: 0, Errors: 0, Skipped: 0, Time elapsed: 46.64 sec - in org.apache.hadoop.cli.TestHDFSCLI
Running org.apache.hadoop.cli.TestXAttrCLI
Tests run: 1, Failures: 0, Errors: 0, Skipped: 0, Time elapsed: 6.664 sec - in org.apache.hadoop.cli.TestXAttrCLI
Running org.apache.hadoop.cli.TestCacheAdminCLI
Tests run: 1, Failures: 0, Errors: 0, Skipped: 0, Time elapsed: 6.007 sec - in org.apache.hadoop.cli.TestCacheAdminCLI
Running org.apache.hadoop.cli.TestCryptoAdminCLI
Tests run: 1, Failures: 0, Errors: 0, Skipped: 0, Time elapsed: 6.471 sec - in org.apache.hadoop.cli.TestCryptoAdminCLI
Running org.apache.hadoop.cli.TestAclCLI
Tests run: 1, Failures: 0, Errors: 0, Skipped: 0, Time elapsed: 5.42 sec - in org.apache.hadoop.cli.TestAclCLI
Running org.apache.hadoop.fs.TestXAttr
Tests run: 2, Failures: 0, Errors: 0, Skipped: 0, Time elapsed: 0.072 sec - in org.apache.hadoop.fs.TestXAttr
Running org.apache.hadoop.fs.TestResolveHdfsSymlink
Tests run: 4, Failures: 0, Errors: 0, Skipped: 0, Time elapsed: 3.242 sec - in org.apache.hadoop.fs.TestResolveHdfsSymlink
Running org.apache.hadoop.fs.TestVolumeId
Tests run: 3, Failures: 0, Errors: 0, Skipped: 0, Time elapsed: 0.162 sec - in org.apache.hadoop.fs.TestVolumeId
Running org.apache.hadoop.fs.TestFcHdfsSetUMask
Tests run: 12, Failures: 0, Errors: 0, Skipped: 0, Time elapsed: 3.481 sec - in org.apache.hadoop.fs.TestFcHdfsSetUMask
Running org.apache.hadoop.fs.loadGenerator.TestLoadGenerator
Tests run: 2, Failures: 0, Errors: 0, Skipped: 0, Time elapsed: 13.583 sec - in org.apache.hadoop.fs.loadGenerator.TestLoadGenerator
Running org.apache.hadoop.fs.viewfs.TestViewFsFileStatusHdfs
Tests run: 2, Failures: 0, Errors: 0, Skipped: 0, Time elapsed: 3.301 sec - in org.apache.hadoop.fs.viewfs.TestViewFsFileStatusHdfs
Running org.apache.hadoop.fs.viewfs.TestViewFsAtHdfsRoot
Tests run: 54, Failures: 0, Errors: 0, Skipped: 0, Time elapsed: 7.649 sec - in org.apache.hadoop.fs.viewfs.TestViewFsAtHdfsRoot
Running org.apache.hadoop.fs.viewfs.TestViewFileSystemWithAcls
Tests run: 1, Failures: 0, Errors: 0, Skipped: 0, Time elapsed: 3.777 sec - in org.apache.hadoop.fs.viewfs.TestViewFileSystemWithAcls
Running org.apache.hadoop.fs.viewfs.TestViewFileSystemWithXAttrs
Tests run: 1, Failures: 0, Errors: 0, Skipped: 0, Time elapsed: 3.716 sec - in org.apache.hadoop.fs.viewfs.TestViewFileSystemWithXAttrs
Running org.apache.hadoop.fs.viewfs.TestViewFsWithAcls
Tests run: 1, Failures: 0, Errors: 0, Skipped: 0, Time elapsed: 3.784 sec - in org.apache.hadoop.fs.viewfs.TestViewFsWithAcls
Running org.apache.hadoop.fs.viewfs.TestViewFsDefaultValue
Tests run: 4, Failures: 0, Errors: 0, Skipped: 0, Time elapsed: 3.058 sec - in org.apache.hadoop.fs.viewfs.TestViewFsDefaultValue
Running org.apache.hadoop.fs.viewfs.TestViewFsHdfs
Tests run: 54, Failures: 0, Errors: 0, Skipped: 0, Time elapsed: 7.27 sec - in org.apache.hadoop.fs.viewfs.TestViewFsHdfs
Running org.apache.hadoop.fs.viewfs.TestViewFileSystemHdfs
Tests run: 52, Failures: 0, Errors: 0, Skipped: 0, Time elapsed: 7.624 sec - in org.apache.hadoop.fs.viewfs.TestViewFileSystemHdfs
Running org.apache.hadoop.fs.viewfs.TestViewFileSystemAtHdfsRoot
Tests run: 52, Failures: 0, Errors: 0, Skipped: 0, Time elapsed: 7.572 sec - in org.apache.hadoop.fs.viewfs.TestViewFileSystemAtHdfsRoot
Running org.apache.hadoop.fs.viewfs.TestViewFsWithXAttrs
Tests run: 1, Failures: 0, Errors: 0, Skipped: 0, Time elapsed: 3.744 sec - in org.apache.hadoop.fs.viewfs.TestViewFsWithXAttrs
Running org.apache.hadoop.fs.contract.hdfs.TestHDFSContractConcat
Tests run: 4, Failures: 0, Errors: 0, Skipped: 0, Time elapsed: 3.569 sec - in org.apache.hadoop.fs.contract.hdfs.TestHDFSContractConcat
Running org.apache.hadoop.fs.contract.hdfs.TestHDFSContractRootDirectory
Tests run: 5, Failures: 0, Errors: 0, Skipped: 0, Time elapsed: 3.441 sec - in org.apache.hadoop.fs.contract.hdfs.TestHDFSContractRootDirectory
Running org.apache.hadoop.fs.contract.hdfs.TestHDFSContractCreate
Tests run: 6, Failures: 0, Errors: 0, Skipped: 0, Time elapsed: 3.741 sec - in org.apache.hadoop.fs.contract.hdfs.TestHDFSContractCreate
Running org.apache.hadoop.fs.contract.hdfs.TestHDFSContractSeek
Tests run: 10, Failures: 0, Errors: 0, Skipped: 0, Time elapsed: 5.932 sec - in org.apache.hadoop.fs.contract.hdfs.TestHDFSContractSeek
Running org.apache.hadoop.fs.contract.hdfs.TestHDFSContractAppend
Tests run: 5, Failures: 0, Errors: 0, Skipped: 1, Time elapsed: 3.879 sec - in org.apache.hadoop.fs.contract.hdfs.TestHDFSContractAppend
Running org.apache.hadoop.fs.contract.hdfs.TestHDFSContractRename
Tests run: 5, Failures: 0, Errors: 0, Skipped: 0, Time elapsed: 3.566 sec - in org.apache.hadoop.fs.contract.hdfs.TestHDFSContractRename
Running org.apache.hadoop.fs.contract.hdfs.TestHDFSContractMkdir
Tests run: 4, Failures: 0, Errors: 0, Skipped: 0, Time elapsed: 3.565 sec - in org.apache.hadoop.fs.contract.hdfs.TestHDFSContractMkdir
Running org.apache.hadoop.fs.contract.hdfs.TestHDFSContractOpen
Tests run: 5, Failures: 0, Errors: 0, Skipped: 0, Time elapsed: 3.491 sec - in org.apache.hadoop.fs.contract.hdfs.TestHDFSContractOpen
Running org.apache.hadoop.fs.contract.hdfs.TestHDFSContractDelete
Tests run: 6, Failures: 0, Errors: 0, Skipped: 0, Time elapsed: 3.769 sec - in org.apache.hadoop.fs.contract.hdfs.TestHDFSContractDelete
Running org.apache.hadoop.fs.TestFcHdfsPermission
Tests run: 4, Failures: 0, Errors: 0, Skipped: 0, Time elapsed: 3.488 sec - in org.apache.hadoop.fs.TestFcHdfsPermission
Running org.apache.hadoop.fs.TestSymlinkHdfsFileSystem
Tests run: 72, Failures: 0, Errors: 0, Skipped: 2, Time elapsed: 8.3 sec - in org.apache.hadoop.fs.TestSymlinkHdfsFileSystem
Running org.apache.hadoop.fs.TestFcHdfsCreateMkdir
Tests run: 8, Failures: 0, Errors: 0, Skipped: 0, Time elapsed: 3.464 sec - in org.apache.hadoop.fs.TestFcHdfsCreateMkdir
Running org.apache.hadoop.fs.TestUrlStreamHandlerFactory
Tests run: 1, Failures: 0, Errors: 0, Skipped: 0, Time elapsed: 1.385 sec - in org.apache.hadoop.fs.TestUrlStreamHandlerFactory
Running org.apache.hadoop.fs.permission.TestStickyBit
Tests run: 6, Failures: 0, Errors: 0, Skipped: 0, Time elapsed: 6.594 sec - in org.apache.hadoop.fs.permission.TestStickyBit
Running org.apache.hadoop.fs.shell.TestHdfsTextCommand
Tests run: 1, Failures: 0, Errors: 0, Skipped: 0, Time elapsed: 3.643 sec - in org.apache.hadoop.fs.shell.TestHdfsTextCommand
Running org.apache.hadoop.fs.TestHdfsNativeCodeLoader
Tests run: 1, Failures: 0, Errors: 0, Skipped: 0, Time elapsed: 0.14 sec - in org.apache.hadoop.fs.TestHdfsNativeCodeLoader
Running org.apache.hadoop.fs.TestSymlinkHdfsDisable
Tests run: 1, Failures: 0, Errors: 0, Skipped: 0, Time elapsed: 3.022 sec - in org.apache.hadoop.fs.TestSymlinkHdfsDisable
Running org.apache.hadoop.fs.TestGlobPaths
Tests run: 35, Failures: 0, Errors: 0, Skipped: 6, Time elapsed: 4.583 sec - in org.apache.hadoop.fs.TestGlobPaths
Running org.apache.hadoop.fs.TestUrlStreamHandler
Tests run: 2, Failures: 0, Errors: 0, Skipped: 0, Time elapsed: 3.572 sec - in org.apache.hadoop.fs.TestUrlStreamHandler
Running org.apache.hadoop.fs.TestEnhancedByteBufferAccess
Tests run: 10, Failures: 0, Errors: 0, Skipped: 1, Time elapsed: 14.215 sec - in org.apache.hadoop.fs.TestEnhancedByteBufferAccess
Running org.apache.hadoop.fs.TestHDFSFileContextMainOperations
Tests run: 67, Failures: 0, Errors: 0, Skipped: 0, Time elapsed: 6.357 sec - in org.apache.hadoop.fs.TestHDFSFileContextMainOperations
Running org.apache.hadoop.fs.TestSymlinkHdfsFileContext
Tests run: 69, Failures: 0, Errors: 0, Skipped: 0, Time elapsed: 8.357 sec - in org.apache.hadoop.fs.TestSymlinkHdfsFileContext
Running org.apache.hadoop.tools.TestTools
Tests run: 5, Failures: 0, Errors: 0, Skipped: 0, Time elapsed: 1.204 sec - in org.apache.hadoop.tools.TestTools
Running org.apache.hadoop.tools.TestJMXGet
Tests run: 2, Failures: 0, Errors: 0, Skipped: 0, Time elapsed: 4.249 sec - in org.apache.hadoop.tools.TestJMXGet

Results :

Tests in error: 
  TestBalancerWithEncryptedTransfer.testEncryptedBalancer0:38 ? Timeout Rebalanc...

Tests run: 3009, Failures: 0, Errors: 1, Skipped: 18

[INFO]                                                                         
[INFO] ------------------------------------------------------------------------
[INFO] Skipping Apache Hadoop HttpFS
[INFO] This project has been banned from the build due to previous failures.
[INFO] ------------------------------------------------------------------------
[INFO]                                                                         
[INFO] ------------------------------------------------------------------------
[INFO] Skipping Apache Hadoop HDFS BookKeeper Journal
[INFO] This project has been banned from the build due to previous failures.
[INFO] ------------------------------------------------------------------------
[INFO]                                                                         
[INFO] ------------------------------------------------------------------------
[INFO] Skipping Apache Hadoop HDFS-NFS
[INFO] This project has been banned from the build due to previous failures.
[INFO] ------------------------------------------------------------------------
[INFO]                                                                         
[INFO] ------------------------------------------------------------------------
[INFO] Building Apache Hadoop HDFS Project 3.0.0-SNAPSHOT
[INFO] ------------------------------------------------------------------------
[WARNING] The POM for org.eclipse.m2e:lifecycle-mapping:jar:1.0.0 is missing, no dependency
information available
[WARNING] Failed to retrieve plugin descriptor for org.eclipse.m2e:lifecycle-mapping:1.0.0:
Plugin org.eclipse.m2e:lifecycle-mapping:1.0.0 or one of its dependencies could not be resolved:
Failure to find org.eclipse.m2e:lifecycle-mapping:jar:1.0.0 in http://repo.maven.apache.org/maven2
was cached in the local repository, resolution will not be reattempted until the update interval
of central has elapsed or updates are forced
[INFO] 
[INFO] --- maven-clean-plugin:2.4.1:clean (default-clean) @ hadoop-hdfs-project ---
[INFO] Deleting <https://builds.apache.org/job/Hadoop-Hdfs-trunk/ws/hadoop-hdfs-project/target>
[INFO] 
[INFO] --- maven-antrun-plugin:1.7:run (create-testdirs) @ hadoop-hdfs-project ---
[INFO] Executing tasks

main:
    [mkdir] Created dir: <https://builds.apache.org/job/Hadoop-Hdfs-trunk/ws/hadoop-hdfs-project/target/test-dir>
[INFO] Executed tasks
[INFO] 
[INFO] --- maven-source-plugin:2.1.2:jar-no-fork (hadoop-java-sources) @ hadoop-hdfs-project
---
[INFO] 
[INFO] --- maven-source-plugin:2.1.2:test-jar-no-fork (hadoop-java-sources) @ hadoop-hdfs-project
---
[INFO] 
[INFO] --- maven-enforcer-plugin:1.3.1:enforce (dist-enforce) @ hadoop-hdfs-project ---
[INFO] 
[INFO] --- maven-site-plugin:3.3:attach-descriptor (attach-descriptor) @ hadoop-hdfs-project
---
[INFO] 
[INFO] --- maven-javadoc-plugin:2.8.1:jar (module-javadocs) @ hadoop-hdfs-project ---
[INFO] Not executing Javadoc as the project is not a Java classpath-capable package
[INFO] 
[INFO] --- maven-enforcer-plugin:1.3.1:enforce (depcheck) @ hadoop-hdfs-project ---
[INFO] 
[INFO] --- maven-checkstyle-plugin:2.6:checkstyle (default-cli) @ hadoop-hdfs-project ---
[INFO] 
[INFO] --- findbugs-maven-plugin:2.3.2:findbugs (default-cli) @ hadoop-hdfs-project ---
[INFO] ****** FindBugsMojo execute *******
[INFO] canGenerate is false
[INFO] ------------------------------------------------------------------------
[INFO] Reactor Summary:
[INFO] 
[INFO] Apache Hadoop HDFS ................................ FAILURE [  02:08 h]
[INFO] Apache Hadoop HttpFS .............................. SKIPPED
[INFO] Apache Hadoop HDFS BookKeeper Journal ............. SKIPPED
[INFO] Apache Hadoop HDFS-NFS ............................ SKIPPED
[INFO] Apache Hadoop HDFS Project ........................ SUCCESS [  2.282 s]
[INFO] ------------------------------------------------------------------------
[INFO] BUILD FAILURE
[INFO] ------------------------------------------------------------------------
[INFO] Total time: 02:08 h
[INFO] Finished at: 2014-09-04T13:42:36+00:00
[INFO] Final Memory: 66M/942M
[INFO] ------------------------------------------------------------------------
[ERROR] Failed to execute goal org.apache.maven.plugins:maven-surefire-plugin:2.16:test (default-test)
on project hadoop-hdfs: There are test failures.
[ERROR] 
[ERROR] Please refer to <https://builds.apache.org/job/Hadoop-Hdfs-trunk/ws/hadoop-hdfs-project/hadoop-hdfs/target/surefire-reports>
for the individual test results.
[ERROR] -> [Help 1]
[ERROR] 
[ERROR] To see the full stack trace of the errors, re-run Maven with the -e switch.
[ERROR] Re-run Maven using the -X switch to enable full debug logging.
[ERROR] 
[ERROR] For more information about the errors and possible solutions, please read the following
articles:
[ERROR] [Help 1] http://cwiki.apache.org/confluence/display/MAVEN/MojoFailureException
Build step 'Execute shell' marked build as failure
Archiving artifacts
Recording test results
Updating HADOOP-10863
Updating HADOOP-11056
Updating HDFS-6959
Updating HDFS-6848
Updating MAPREDUCE-6063
Updating YARN-2394
Updating HADOOP-10956
Updating HDFS-2975

Mime
View raw message