hadoop-hdfs-dev mailing list archives

Site index · List index
Message view « Date » · « Thread »
Top « Date » · « Thread »
From Apache Jenkins Server <jenk...@builds.apache.org>
Subject Hadoop-Hdfs-trunk - Build # 1862 - Still Failing
Date Fri, 05 Sep 2014 13:45:31 GMT
See https://builds.apache.org/job/Hadoop-Hdfs-trunk/1862/

###################################################################################
########################## LAST 60 LINES OF THE CONSOLE ###########################
[...truncated 5507 lines...]
[INFO] 
[INFO] --- maven-source-plugin:2.1.2:test-jar-no-fork (hadoop-java-sources) @ hadoop-hdfs-project
---
[INFO] 
[INFO] --- maven-enforcer-plugin:1.3.1:enforce (dist-enforce) @ hadoop-hdfs-project ---
[INFO] 
[INFO] --- maven-site-plugin:3.3:attach-descriptor (attach-descriptor) @ hadoop-hdfs-project
---
[INFO] 
[INFO] --- maven-javadoc-plugin:2.8.1:jar (module-javadocs) @ hadoop-hdfs-project ---
[INFO] Not executing Javadoc as the project is not a Java classpath-capable package
[INFO] 
[INFO] --- maven-enforcer-plugin:1.3.1:enforce (depcheck) @ hadoop-hdfs-project ---
[INFO] 
[INFO] --- maven-checkstyle-plugin:2.6:checkstyle (default-cli) @ hadoop-hdfs-project ---
[INFO] 
[INFO] --- findbugs-maven-plugin:2.3.2:findbugs (default-cli) @ hadoop-hdfs-project ---
[INFO] ****** FindBugsMojo execute *******
[INFO] canGenerate is false
[INFO] ------------------------------------------------------------------------
[INFO] Reactor Summary:
[INFO] 
[INFO] Apache Hadoop HDFS ................................ FAILURE [  02:09 h]
[INFO] Apache Hadoop HttpFS .............................. SKIPPED
[INFO] Apache Hadoop HDFS BookKeeper Journal ............. SKIPPED
[INFO] Apache Hadoop HDFS-NFS ............................ SKIPPED
[INFO] Apache Hadoop HDFS Project ........................ SUCCESS [  2.297 s]
[INFO] ------------------------------------------------------------------------
[INFO] BUILD FAILURE
[INFO] ------------------------------------------------------------------------
[INFO] Total time: 02:09 h
[INFO] Finished at: 2014-09-05T13:43:12+00:00
[INFO] Final Memory: 64M/939M
[INFO] ------------------------------------------------------------------------
[ERROR] Failed to execute goal org.apache.maven.plugins:maven-surefire-plugin:2.16:test (default-test)
on project hadoop-hdfs: There are test failures.
[ERROR] 
[ERROR] Please refer to /home/jenkins/jenkins-slave/workspace/Hadoop-Hdfs-trunk/hadoop-hdfs-project/hadoop-hdfs/target/surefire-reports
for the individual test results.
[ERROR] -> [Help 1]
[ERROR] 
[ERROR] To see the full stack trace of the errors, re-run Maven with the -e switch.
[ERROR] Re-run Maven using the -X switch to enable full debug logging.
[ERROR] 
[ERROR] For more information about the errors and possible solutions, please read the following
articles:
[ERROR] [Help 1] http://cwiki.apache.org/confluence/display/MAVEN/MojoFailureException
Build step 'Execute shell' marked build as failure
Archiving artifacts
Recording test results
Updating HDFS-6996
Updating HDFS-6714
Updating YARN-2431
Updating HADOOP-11063
Updating HDFS-6905
Updating HADOOP-11015
Updating HADOOP-11054
Updating YARN-2509
Updating YARN-2511
Updating HADOOP-11060
Updating HDFS-6886
Sending e-mails to: hdfs-dev@hadoop.apache.org
Email was triggered for: Failure
Sending email for trigger: Failure



###################################################################################
############################## FAILED TESTS (if any) ##############################
1 tests failed.
REGRESSION:  org.apache.hadoop.hdfs.server.blockmanagement.TestBlockTokenWithDFS.testEnd2End

Error Message:
Rebalancing expected avg utilization to become 0.2, but on datanode 127.0.0.1:42576 it remains
at 0.08 after more than 40000 msec.

Stack Trace:
java.util.concurrent.TimeoutException: Rebalancing expected avg utilization to become 0.2,
but on datanode 127.0.0.1:42576 it remains at 0.08 after more than 40000 msec.
	at org.apache.hadoop.hdfs.server.balancer.TestBalancer.waitForBalancer(TestBalancer.java:321)
	at org.apache.hadoop.hdfs.server.balancer.TestBalancer.runBalancer(TestBalancer.java:580)
	at org.apache.hadoop.hdfs.server.balancer.TestBalancer.doTest(TestBalancer.java:551)
	at org.apache.hadoop.hdfs.server.balancer.TestBalancer.doTest(TestBalancer.java:437)
	at org.apache.hadoop.hdfs.server.balancer.TestBalancer.oneNodeTest(TestBalancer.java:645)
	at org.apache.hadoop.hdfs.server.balancer.TestBalancer.integrationTest(TestBalancer.java:658)
	at org.apache.hadoop.hdfs.server.blockmanagement.TestBlockTokenWithDFS.testEnd2End(TestBlockTokenWithDFS.java:592)



Mime
  • Unnamed multipart/mixed (inline, None, 0 bytes)
View raw message