hadoop-hdfs-dev mailing list archives

Site index · List index
Message view « Date » · « Thread »
Top « Date » · « Thread »
From Apache Jenkins Server <jenk...@builds.apache.org>
Subject Hadoop-Hdfs-trunk - Build # 1876 - Still Failing
Date Fri, 19 Sep 2014 13:52:28 GMT
See https://builds.apache.org/job/Hadoop-Hdfs-trunk/1876/

###################################################################################
########################## LAST 60 LINES OF THE CONSOLE ###########################
[...truncated 6092 lines...]
Build step 'Execute shell' marked build as failure
Archiving artifacts
Recording test results
Updating YARN-2001
Updating MAPREDUCE-6090
Updating HADOOP-11105
Updating HADOOP-11106
Updating HDFS-6670
Updating HADOOP-11084
Updating HDFS-7052
Updating MAPREDUCE-5891
Updating HDFS-6671
Updating HDFS-6979
Updating YARN-2563
Updating HDFS-6584
Updating HADOOP-11109
Updating YARN-2568
Updating HDFS-7047
Updating MAPREDUCE-6086
Updating HDFS-6970
Updating HDFS-6876
Updating HDFS-6875
Updating HDFS-6835
Updating YARN-2561
Updating HDFS-7003
Updating HDFS-6727
Updating HDFS-6920
Updating HDFS-6969
Updating HDFS-6679
Updating HDFS-6677
Updating HDFS-7039
Updating HDFS-6961
Updating HDFS-6864
Updating HDFS-6863
Updating HDFS-6862
Updating YARN-1779
Updating HDFS-6911
Updating HDFS-7034
Updating HDFS-6710
Updating HADOOP-11065
Updating HDFS-7072
Updating HDFS-6997
Updating HADOOP-11067
Updating HDFS-6686
Updating HDFS-7028
Updating HDFS-7027
Updating HDFS-7029
Updating YARN-2363
Updating HDFS-6906
Updating HDFS-7062
Updating HADOOP-11052
Updating HDFS-6801
Updating HDFS-7088
Updating HDFS-6840
Updating HDFS-6944
Updating HDFS-6847
Sending e-mails to: hdfs-dev@hadoop.apache.org
Email was triggered for: Failure
Sending email for trigger: Failure



###################################################################################
############################## FAILED TESTS (if any) ##############################
2 tests failed.
FAILED:  org.apache.hadoop.hdfs.server.mover.TestStorageMover.testNoSpaceArchive

Error Message:
null

Stack Trace:
java.lang.AssertionError: null
	at org.junit.Assert.fail(Assert.java:86)
	at org.junit.Assert.assertTrue(Assert.java:41)
	at org.junit.Assert.assertTrue(Assert.java:52)
	at org.apache.hadoop.hdfs.server.mover.TestStorageMover.testNoSpaceArchive(TestStorageMover.java:720)


FAILED:  org.apache.hadoop.hdfs.server.mover.TestStorageMover.testNoSpaceDisk

Error Message:
null

Stack Trace:
java.lang.AssertionError: null
	at org.junit.Assert.fail(Assert.java:86)
	at org.junit.Assert.assertTrue(Assert.java:41)
	at org.junit.Assert.assertTrue(Assert.java:52)
	at org.apache.hadoop.hdfs.server.mover.TestStorageMover.testNoSpaceDisk(TestStorageMover.java:637)



Mime
  • Unnamed multipart/mixed (inline, None, 0 bytes)
View raw message