hadoop-hdfs-dev mailing list archives

Site index · List index
Message view « Date » · « Thread »
Top « Date » · « Thread »
From Apache Jenkins Server <jenk...@builds.apache.org>
Subject Build failed in Jenkins: Hadoop-Hdfs-trunk #1876
Date Fri, 19 Sep 2014 13:52:25 GMT
See <https://builds.apache.org/job/Hadoop-Hdfs-trunk/1876/changes>

Changes:

[szetszwo] HDFS-6677. Change INodeFile and FSImage to support storage policy ID.

[szetszwo] HDFS-6670. Add block storage policy support with default HOT, WARM and COLD policies.

[szetszwo] HDFS-6671. Change BlockPlacementPolicy to consider block storage policy in replicaiton.

[szetszwo] HDFS-6710. Change BlockPlacementPolicy to consider block storage policy in replica
deletion.

[szetszwo] HDFS-6679. Bump NameNodeLayoutVersion and update editsStored test files.  Contributed
by vinayakumarb

[szetszwo] HDFS-6686. Change BlockPlacementPolicy to use fallback when some storage types
are unavailable.

[jing9] HDFS-6835. Archival Storage: Add a new API to set storage policy. Contributed by Jing
Zhao.

[szetszwo] HDFS-6847. Support storage policy on directories and include storage policy in
HdfsFileStatus.  Contributed by Jing Zhao

[jing9] HDFS-6801. Archival Storage: Add a new data migration tool. Contributed by Tsz Wo
Nicholas Sze.

[jing9] HDFS-6863. Archival Storage: Support migration for snapshot paths. Contributed by
Jing Zhao.

[jing9] HDFS-6906. Archival Storage: Add more tests for BlockStoragePolicy. Contributed by
Tsz Wo Nicholas Sze.

[jing9] HDFS-6911. Archival Storage: check if a block is already scheduled in Mover. Contributed
by Tsz Wo Nicholas Sze.

[jing9] HDFS-6920. Archival Storage: check the storage type of delNodeHintStorage when deleting
a replica. Contributed by Tsz Wo Nicholas Sze.

[jing9] HDFS-6944. Archival Storage: add retry and termination logic for Mover. Contributed
by Jing Zhao.

[jing9] HDFS-6969. Archival Storage: INode#getStoragePolicyID should always return the latest
storage policy. Contributed by Jing Zhao.

[jing9] HDFS-6961. Archival Storage: BlockPlacementPolicy#chooseTarget should check each valid
storage type in each choosing round.

[jing9] HDFS-6876. Archival Storage: support set/get storage policy in DFSAdmin. Contributed
by Jing Zhao.

[jing9] Fix TestOfflineEditsViewer after merging.

[jing9] HDFS-6979. hdfs.dll not produce .pdb files. Contributed by Chris Nauroth.

[jing9] HDFS-6979. Fix minor error in CHANGES.txt. Contributed by Chris Nauroth.

[jing9] HDFS-6862. Add missing timeout annotations to tests. (Contributed by Xiaoyu Yao)

[jing9] HDFS-6998. warning message 'ssl.client.truststore.location has not been set' gets
printed for hftp command. (Contributed by Xiaoyu Yao)

[jing9] HADOOP-11052. hadoop_verify_secure_prereq's results aren't checked in bin/hdfs (aw)

[jing9] HADOOP-11065. Rat check should exclude **/build/**. (kasha)

[szetszwo] HDFS-6997: add more tests for data migration and replicaion.

[jing9] HDFS-6875. Archival Storage: support migration for a list of specified paths. Contributed
by Jing Zhao.

[jing9] HDFS-7027. Archival Storage: Mover does not terminate when some storage type is out
of space. Contributed by Tsz Wo Nicholas Sze.

[jing9] HDFS-7029. Archival Storage: fix TestDFSInotifyEventInputStream and TestDistributedFileSystem.
Contributed by Tsz Wo Nicholas Sze.

[szetszwo] HDFS-7028: FSDirectory should not get storage policy id from symlinks

[jing9] HDFS-7034. Archival Storage: Fix TestBlockPlacement and TestStorageMover. Contributed
by Jing Zhao.

[jing9] HDFS-7039. Archival Storage: fix Balancer tests. Contributed by Tsz Wo Nicholas Sze.

[jing9] HDFS-7062. Archival Storage: skip under construction block for migration. Contributed
by Jing Zhao.

[jing] HDFS-7052. Archival Storage: Add Mover into hdfs script. Contributed by Jing Zhao.

[szetszwo] HDFS-7072. Fix TestBlockManager and TestStorageMover.  Contributed by Jing Zhao

[szetszwo] Fix hadoop-hdfs-project/hadoop-hdfs/CHANGES.txt .

[jing] HDFS-6864. Archival Storage: add user documentation. Contributed by Tsz Wo Nicholas
Sze.

[vinodkv] YARN-1779. Fixed AMRMClient to handle AMRMTokens correctly across ResourceManager
work-preserving-restart or failover. Contributed by Jian He.

[jing] HDFS-7088. Archival Storage: fix TestBalancer and TestBalancerWithMultipleNameNodes.
Contributed by Tsz Wo Nicholas Sze.

[vinodkv] YARN-2001. Added a time threshold for RM to wait before starting container allocations
after restart/failover. Contributed by Jian He.

[cmccabe] HDFS-7047. Expose FileStatus#isEncrypted in libhdfs (cmccabe)

[jlowe] YARN-2363. Submitted applications occasionally lack a tracking URL. Contributed by
Jason Lowe

[stevel] HADOOP-11084 jenkins patchprocess links are broken

[jlowe] MAPREDUCE-6090. mapred hsadmin getGroups fails to connect in some cases. Contributed
by Robert Kanter

[jlowe] YARN-2561. MR job client cannot reconnect to AM after NM restart. Contributed by Junping
Du

[jianhe] YARN-2563. Fixed YarnClient to call getTimeLineDelegationToken only if the Token
is not present. Contributed by Zhijie Shen

[wang] HADOOP-11106. Document considerations of HAR and Encryption. (clamb via wang)

[wang] HDFS-7003. Add NFS Gateway support for reading and writing to encryption zones. (clamb
via wang)

[jlowe] MAPREDUCE-5891. Improved shuffle error handling across NM restarts. Contributed by
Junping Du

[cnauroth] HADOOP-11105. MetricsSystemImpl could leak memory in registered callbacks. Contributed
by Chuan Liu.

[cnauroth] HADOOP-11105. Update CHANGES.txt.

[kasha] MAPREDUCE-6086. mapreduce.job.credentials.binary should allow all URIs. (Zhihai Xu
via kasha)

[tucu] KMS: Support for multiple Kerberos principals. (tucu)

[szetszwo] Fix hadoop-hdfs-project/hadoop-hdfs/CHANGES.txt for HDFS-6584 after

[szetszwo] Revise the HDFS-6584 entry CHANGES.txt.

[cmccabe] HDFS-6727. Refresh data volumes on DataNode based on configuration changes (Lei
Xu via Colin Patrick McCabe)

[wang] HDFS-6970. Move startFile EDEK retries to the DFSClient. (wang)

[wang] HDFS-6840. Clients are always sent to the same datanode when read is off rack. (wang)

[atm] HADOOP-11109. Site build is broken. Contributed by Jian He.

[zjshen] YARN-2568. Fixed the potential test failures due to race conditions when RM work-preserving
recovery is enabled. Contributed by Jian He.

------------------------------------------
[...truncated 5899 lines...]
Tests run: 5, Failures: 0, Errors: 0, Skipped: 0, Time elapsed: 3.574 sec - in org.apache.hadoop.hdfs.TestFileStatus
Running org.apache.hadoop.hdfs.TestEncryptionZonesWithHA
Tests run: 1, Failures: 0, Errors: 0, Skipped: 0, Time elapsed: 5.282 sec - in org.apache.hadoop.hdfs.TestEncryptionZonesWithHA
Running org.apache.hadoop.hdfs.TestRollingUpgradeRollback
Tests run: 3, Failures: 0, Errors: 0, Skipped: 0, Time elapsed: 9.345 sec - in org.apache.hadoop.hdfs.TestRollingUpgradeRollback
Running org.apache.hadoop.hdfs.TestDFSStartupVersions
Tests run: 1, Failures: 0, Errors: 0, Skipped: 0, Time elapsed: 10.354 sec - in org.apache.hadoop.hdfs.TestDFSStartupVersions
Running org.apache.hadoop.hdfs.TestDFSShellGenericOptions
Tests run: 1, Failures: 0, Errors: 0, Skipped: 0, Time elapsed: 3.48 sec - in org.apache.hadoop.hdfs.TestDFSShellGenericOptions
Running org.apache.hadoop.hdfs.protocolPB.TestPBHelper
Tests run: 28, Failures: 0, Errors: 0, Skipped: 0, Time elapsed: 0.835 sec - in org.apache.hadoop.hdfs.protocolPB.TestPBHelper
Running org.apache.hadoop.hdfs.TestLeaseRenewer
Tests run: 4, Failures: 0, Errors: 0, Skipped: 0, Time elapsed: 1.251 sec - in org.apache.hadoop.hdfs.TestLeaseRenewer
Running org.apache.hadoop.hdfs.TestDatanodeBlockScanner
Tests run: 7, Failures: 0, Errors: 0, Skipped: 0, Time elapsed: 161.103 sec - in org.apache.hadoop.hdfs.TestDatanodeBlockScanner
Running org.apache.hadoop.hdfs.TestDFSRemove
Tests run: 1, Failures: 0, Errors: 0, Skipped: 0, Time elapsed: 14.515 sec - in org.apache.hadoop.hdfs.TestDFSRemove
Running org.apache.hadoop.hdfs.TestFileAppend4
Tests run: 4, Failures: 0, Errors: 0, Skipped: 0, Time elapsed: 28.909 sec - in org.apache.hadoop.hdfs.TestFileAppend4
Running org.apache.hadoop.hdfs.TestParallelRead
Tests run: 4, Failures: 0, Errors: 0, Skipped: 0, Time elapsed: 39.674 sec - in org.apache.hadoop.hdfs.TestParallelRead
Running org.apache.hadoop.hdfs.TestClose
Tests run: 1, Failures: 0, Errors: 0, Skipped: 0, Time elapsed: 3.395 sec - in org.apache.hadoop.hdfs.TestClose
Running org.apache.hadoop.hdfs.TestDFSAddressConfig
Tests run: 1, Failures: 0, Errors: 0, Skipped: 0, Time elapsed: 4.087 sec - in org.apache.hadoop.hdfs.TestDFSAddressConfig
Running org.apache.hadoop.hdfs.TestParallelShortCircuitLegacyRead
Tests run: 4, Failures: 0, Errors: 0, Skipped: 0, Time elapsed: 16.145 sec - in org.apache.hadoop.hdfs.TestParallelShortCircuitLegacyRead
Running org.apache.hadoop.hdfs.TestLargeBlock
Tests run: 1, Failures: 0, Errors: 0, Skipped: 0, Time elapsed: 13.423 sec - in org.apache.hadoop.hdfs.TestLargeBlock
Running org.apache.hadoop.hdfs.TestHDFSTrash
Tests run: 2, Failures: 0, Errors: 0, Skipped: 0, Time elapsed: 5.893 sec - in org.apache.hadoop.hdfs.TestHDFSTrash
Running org.apache.hadoop.hdfs.TestClientReportBadBlock
Tests run: 3, Failures: 0, Errors: 0, Skipped: 0, Time elapsed: 6.719 sec - in org.apache.hadoop.hdfs.TestClientReportBadBlock
Running org.apache.hadoop.hdfs.TestWriteRead
Tests run: 3, Failures: 0, Errors: 0, Skipped: 0, Time elapsed: 25.525 sec - in org.apache.hadoop.hdfs.TestWriteRead
Running org.apache.hadoop.hdfs.TestClientProtocolForPipelineRecovery
Tests run: 4, Failures: 0, Errors: 0, Skipped: 0, Time elapsed: 32.424 sec - in org.apache.hadoop.hdfs.TestClientProtocolForPipelineRecovery
Running org.apache.hadoop.hdfs.TestBalancerBandwidth
Tests run: 1, Failures: 0, Errors: 0, Skipped: 0, Time elapsed: 13.341 sec - in org.apache.hadoop.hdfs.TestBalancerBandwidth
Running org.apache.hadoop.hdfs.TestDFSUpgrade
Tests run: 2, Failures: 0, Errors: 0, Skipped: 0, Time elapsed: 13.092 sec - in org.apache.hadoop.hdfs.TestDFSUpgrade
Running org.apache.hadoop.hdfs.TestBlockStoragePolicy
Tests run: 13, Failures: 0, Errors: 0, Skipped: 0, Time elapsed: 19.342 sec - in org.apache.hadoop.hdfs.TestBlockStoragePolicy
Running org.apache.hadoop.hdfs.TestFileLengthOnClusterRestart
Tests run: 1, Failures: 0, Errors: 0, Skipped: 0, Time elapsed: 10.102 sec - in org.apache.hadoop.hdfs.TestFileLengthOnClusterRestart
Running org.apache.hadoop.hdfs.TestBlockReaderFactory
Tests run: 7, Failures: 0, Errors: 0, Skipped: 0, Time elapsed: 9.75 sec - in org.apache.hadoop.hdfs.TestBlockReaderFactory
Running org.apache.hadoop.hdfs.qjournal.TestNNWithQJM
Tests run: 3, Failures: 0, Errors: 0, Skipped: 0, Time elapsed: 6.62 sec - in org.apache.hadoop.hdfs.qjournal.TestNNWithQJM
Running org.apache.hadoop.hdfs.qjournal.server.TestJournalNodeMXBean
Tests run: 1, Failures: 0, Errors: 0, Skipped: 0, Time elapsed: 1.461 sec - in org.apache.hadoop.hdfs.qjournal.server.TestJournalNodeMXBean
Running org.apache.hadoop.hdfs.qjournal.server.TestJournal
Tests run: 12, Failures: 0, Errors: 0, Skipped: 0, Time elapsed: 1.733 sec - in org.apache.hadoop.hdfs.qjournal.server.TestJournal
Running org.apache.hadoop.hdfs.qjournal.server.TestJournalNode
Tests run: 6, Failures: 0, Errors: 0, Skipped: 0, Time elapsed: 5.8 sec - in org.apache.hadoop.hdfs.qjournal.server.TestJournalNode
Running org.apache.hadoop.hdfs.qjournal.client.TestIPCLoggerChannel
Tests run: 3, Failures: 0, Errors: 0, Skipped: 0, Time elapsed: 1.078 sec - in org.apache.hadoop.hdfs.qjournal.client.TestIPCLoggerChannel
Running org.apache.hadoop.hdfs.qjournal.client.TestQJMWithFaults
Tests run: 2, Failures: 0, Errors: 0, Skipped: 0, Time elapsed: 151.502 sec - in org.apache.hadoop.hdfs.qjournal.client.TestQJMWithFaults
Running org.apache.hadoop.hdfs.qjournal.client.TestEpochsAreUnique
Tests run: 1, Failures: 0, Errors: 0, Skipped: 0, Time elapsed: 6.349 sec - in org.apache.hadoop.hdfs.qjournal.client.TestEpochsAreUnique
Running org.apache.hadoop.hdfs.qjournal.client.TestQuorumJournalManagerUnit
Tests run: 6, Failures: 0, Errors: 0, Skipped: 0, Time elapsed: 1.323 sec - in org.apache.hadoop.hdfs.qjournal.client.TestQuorumJournalManagerUnit
Running org.apache.hadoop.hdfs.qjournal.client.TestSegmentRecoveryComparator
Tests run: 1, Failures: 0, Errors: 0, Skipped: 0, Time elapsed: 0.255 sec - in org.apache.hadoop.hdfs.qjournal.client.TestSegmentRecoveryComparator
Running org.apache.hadoop.hdfs.qjournal.client.TestQuorumCall
Tests run: 1, Failures: 0, Errors: 0, Skipped: 0, Time elapsed: 0.221 sec - in org.apache.hadoop.hdfs.qjournal.client.TestQuorumCall
Running org.apache.hadoop.hdfs.qjournal.client.TestQuorumJournalManager
Tests run: 21, Failures: 0, Errors: 0, Skipped: 0, Time elapsed: 20.987 sec - in org.apache.hadoop.hdfs.qjournal.client.TestQuorumJournalManager
Running org.apache.hadoop.hdfs.qjournal.TestMiniJournalCluster
Tests run: 1, Failures: 0, Errors: 0, Skipped: 0, Time elapsed: 1.632 sec - in org.apache.hadoop.hdfs.qjournal.TestMiniJournalCluster
Running org.apache.hadoop.hdfs.TestFileCreationEmpty
Tests run: 1, Failures: 0, Errors: 0, Skipped: 0, Time elapsed: 8.45 sec - in org.apache.hadoop.hdfs.TestFileCreationEmpty
Running org.apache.hadoop.hdfs.TestBlockMissingException
Tests run: 1, Failures: 0, Errors: 0, Skipped: 0, Time elapsed: 3.827 sec - in org.apache.hadoop.hdfs.TestBlockMissingException
Running org.apache.hadoop.hdfs.TestDataTransferKeepalive
Tests run: 4, Failures: 0, Errors: 0, Skipped: 0, Time elapsed: 14.632 sec - in org.apache.hadoop.hdfs.TestDataTransferKeepalive
Running org.apache.hadoop.hdfs.TestModTime
Tests run: 2, Failures: 0, Errors: 0, Skipped: 0, Time elapsed: 11.399 sec - in org.apache.hadoop.hdfs.TestModTime
Running org.apache.hadoop.hdfs.TestRollingUpgradeDowngrade
Tests run: 2, Failures: 0, Errors: 0, Skipped: 0, Time elapsed: 8.006 sec - in org.apache.hadoop.hdfs.TestRollingUpgradeDowngrade
Running org.apache.hadoop.hdfs.TestLease
Tests run: 5, Failures: 0, Errors: 0, Skipped: 0, Time elapsed: 7.285 sec - in org.apache.hadoop.hdfs.TestLease
Running org.apache.hadoop.hdfs.TestParallelUnixDomainRead
Tests run: 4, Failures: 0, Errors: 0, Skipped: 0, Time elapsed: 41.918 sec - in org.apache.hadoop.hdfs.TestParallelUnixDomainRead
Running org.apache.hadoop.hdfs.TestDeprecatedKeys
Tests run: 1, Failures: 0, Errors: 0, Skipped: 0, Time elapsed: 0.485 sec - in org.apache.hadoop.hdfs.TestDeprecatedKeys
Running org.apache.hadoop.hdfs.TestFSOutputSummer
Tests run: 2, Failures: 0, Errors: 0, Skipped: 0, Time elapsed: 6.798 sec - in org.apache.hadoop.hdfs.TestFSOutputSummer
Running org.apache.hadoop.hdfs.TestRead
Tests run: 3, Failures: 0, Errors: 0, Skipped: 0, Time elapsed: 4.77 sec - in org.apache.hadoop.hdfs.TestRead
Running org.apache.hadoop.hdfs.TestDFSInotifyEventInputStream
Tests run: 5, Failures: 0, Errors: 0, Skipped: 0, Time elapsed: 16.905 sec - in org.apache.hadoop.hdfs.TestDFSInotifyEventInputStream
Running org.apache.hadoop.hdfs.TestCrcCorruption
Tests run: 4, Failures: 0, Errors: 0, Skipped: 0, Time elapsed: 13.237 sec - in org.apache.hadoop.hdfs.TestCrcCorruption
Running org.apache.hadoop.hdfs.TestGetBlocks
Tests run: 3, Failures: 0, Errors: 0, Skipped: 0, Time elapsed: 34.541 sec - in org.apache.hadoop.hdfs.TestGetBlocks
Running org.apache.hadoop.hdfs.TestDataTransferProtocol
Tests run: 3, Failures: 0, Errors: 0, Skipped: 0, Time elapsed: 4.654 sec - in org.apache.hadoop.hdfs.TestDataTransferProtocol
Running org.apache.hadoop.hdfs.TestReadWhileWriting
Tests run: 1, Failures: 0, Errors: 0, Skipped: 0, Time elapsed: 6.108 sec - in org.apache.hadoop.hdfs.TestReadWhileWriting
Running org.apache.hadoop.net.TestNetworkTopology
Tests run: 10, Failures: 0, Errors: 0, Skipped: 0, Time elapsed: 8.494 sec - in org.apache.hadoop.net.TestNetworkTopology
Running org.apache.hadoop.tracing.TestTracingShortCircuitLocalRead
Tests run: 1, Failures: 0, Errors: 0, Skipped: 0, Time elapsed: 3.581 sec - in org.apache.hadoop.tracing.TestTracingShortCircuitLocalRead
Running org.apache.hadoop.tracing.TestTracing
Tests run: 5, Failures: 0, Errors: 0, Skipped: 0, Time elapsed: 4.563 sec - in org.apache.hadoop.tracing.TestTracing
Running org.apache.hadoop.TestRefreshCallQueue
Tests run: 1, Failures: 0, Errors: 0, Skipped: 0, Time elapsed: 3.397 sec - in org.apache.hadoop.TestRefreshCallQueue

Results :

Failed tests: 
  TestStorageMover.testNoSpaceArchive:720 null
  TestStorageMover.testNoSpaceDisk:637 null

Tests run: 3090, Failures: 2, Errors: 0, Skipped: 18

[INFO]                                                                         
[INFO] ------------------------------------------------------------------------
[INFO] Skipping Apache Hadoop HttpFS
[INFO] This project has been banned from the build due to previous failures.
[INFO] ------------------------------------------------------------------------
[INFO]                                                                         
[INFO] ------------------------------------------------------------------------
[INFO] Skipping Apache Hadoop HDFS BookKeeper Journal
[INFO] This project has been banned from the build due to previous failures.
[INFO] ------------------------------------------------------------------------
[INFO]                                                                         
[INFO] ------------------------------------------------------------------------
[INFO] Skipping Apache Hadoop HDFS-NFS
[INFO] This project has been banned from the build due to previous failures.
[INFO] ------------------------------------------------------------------------
[INFO]                                                                         
[INFO] ------------------------------------------------------------------------
[INFO] Building Apache Hadoop HDFS Project 3.0.0-SNAPSHOT
[INFO] ------------------------------------------------------------------------
[WARNING] The POM for org.eclipse.m2e:lifecycle-mapping:jar:1.0.0 is missing, no dependency
information available
[WARNING] Failed to retrieve plugin descriptor for org.eclipse.m2e:lifecycle-mapping:1.0.0:
Plugin org.eclipse.m2e:lifecycle-mapping:1.0.0 or one of its dependencies could not be resolved:
Failure to find org.eclipse.m2e:lifecycle-mapping:jar:1.0.0 in http://repo.maven.apache.org/maven2
was cached in the local repository, resolution will not be reattempted until the update interval
of central has elapsed or updates are forced
[INFO] 
[INFO] --- maven-clean-plugin:2.4.1:clean (default-clean) @ hadoop-hdfs-project ---
[INFO] Deleting <https://builds.apache.org/job/Hadoop-Hdfs-trunk/ws/hadoop-hdfs-project/target>
[INFO] 
[INFO] --- maven-antrun-plugin:1.7:run (create-testdirs) @ hadoop-hdfs-project ---
[INFO] Executing tasks

main:
    [mkdir] Created dir: <https://builds.apache.org/job/Hadoop-Hdfs-trunk/ws/hadoop-hdfs-project/target/test-dir>
[INFO] Executed tasks
[INFO] 
[INFO] --- maven-source-plugin:2.1.2:jar-no-fork (hadoop-java-sources) @ hadoop-hdfs-project
---
[INFO] 
[INFO] --- maven-source-plugin:2.1.2:test-jar-no-fork (hadoop-java-sources) @ hadoop-hdfs-project
---
[INFO] 
[INFO] --- maven-enforcer-plugin:1.3.1:enforce (dist-enforce) @ hadoop-hdfs-project ---
[INFO] 
[INFO] --- maven-site-plugin:3.3:attach-descriptor (attach-descriptor) @ hadoop-hdfs-project
---
[INFO] 
[INFO] --- maven-javadoc-plugin:2.8.1:jar (module-javadocs) @ hadoop-hdfs-project ---
[INFO] Not executing Javadoc as the project is not a Java classpath-capable package
[INFO] 
[INFO] --- maven-enforcer-plugin:1.3.1:enforce (depcheck) @ hadoop-hdfs-project ---
[INFO] 
[INFO] --- maven-checkstyle-plugin:2.6:checkstyle (default-cli) @ hadoop-hdfs-project ---
[INFO] 
[INFO] --- findbugs-maven-plugin:2.3.2:findbugs (default-cli) @ hadoop-hdfs-project ---
[INFO] ****** FindBugsMojo execute *******
[INFO] canGenerate is false
[INFO] ------------------------------------------------------------------------
[INFO] Reactor Summary:
[INFO] 
[INFO] Apache Hadoop HDFS ................................ FAILURE [  02:14 h]
[INFO] Apache Hadoop HttpFS .............................. SKIPPED
[INFO] Apache Hadoop HDFS BookKeeper Journal ............. SKIPPED
[INFO] Apache Hadoop HDFS-NFS ............................ SKIPPED
[INFO] Apache Hadoop HDFS Project ........................ SUCCESS [  2.185 s]
[INFO] ------------------------------------------------------------------------
[INFO] BUILD FAILURE
[INFO] ------------------------------------------------------------------------
[INFO] Total time: 02:15 h
[INFO] Finished at: 2014-09-19T13:50:11+00:00
[INFO] Final Memory: 65M/881M
[INFO] ------------------------------------------------------------------------
[ERROR] Failed to execute goal org.apache.maven.plugins:maven-surefire-plugin:2.16:test (default-test)
on project hadoop-hdfs: There are test failures.
[ERROR] 
[ERROR] Please refer to <https://builds.apache.org/job/Hadoop-Hdfs-trunk/ws/hadoop-hdfs-project/hadoop-hdfs/target/surefire-reports>
for the individual test results.
[ERROR] -> [Help 1]
[ERROR] 
[ERROR] To see the full stack trace of the errors, re-run Maven with the -e switch.
[ERROR] Re-run Maven using the -X switch to enable full debug logging.
[ERROR] 
[ERROR] For more information about the errors and possible solutions, please read the following
articles:
[ERROR] [Help 1] http://cwiki.apache.org/confluence/display/MAVEN/MojoFailureException
Build step 'Execute shell' marked build as failure
Archiving artifacts
Recording test results
Updating YARN-2001
Updating MAPREDUCE-6090
Updating HADOOP-11105
Updating HADOOP-11106
Updating HDFS-6670
Updating HADOOP-11084
Updating HDFS-7052
Updating MAPREDUCE-5891
Updating HDFS-6671
Updating HDFS-6979
Updating YARN-2563
Updating HDFS-6584
Updating HADOOP-11109
Updating YARN-2568
Updating HDFS-7047
Updating MAPREDUCE-6086
Updating HDFS-6970
Updating HDFS-6876
Updating HDFS-6875
Updating HDFS-6835
Updating YARN-2561
Updating HDFS-7003
Updating HDFS-6727
Updating HDFS-6920
Updating HDFS-6969
Updating HDFS-6679
Updating HDFS-6677
Updating HDFS-7039
Updating HDFS-6961
Updating HDFS-6864
Updating HDFS-6863
Updating HDFS-6862
Updating YARN-1779
Updating HDFS-6911
Updating HDFS-7034
Updating HDFS-6710
Updating HADOOP-11065
Updating HDFS-7072
Updating HDFS-6997
Updating HADOOP-11067
Updating HDFS-6686
Updating HDFS-7028
Updating HDFS-7027
Updating HDFS-7029
Updating YARN-2363
Updating HDFS-6906
Updating HDFS-7062
Updating HADOOP-11052
Updating HDFS-6801
Updating HDFS-7088
Updating HDFS-6840
Updating HDFS-6944
Updating HDFS-6847

Mime
View raw message