hadoop-hdfs-dev mailing list archives

Site index · List index
Message view « Date » · « Thread »
Top « Date » · « Thread »
From Apache Jenkins Server <jenk...@builds.apache.org>
Subject Build failed in Jenkins: Hadoop-Hdfs-trunk #1875
Date Thu, 18 Sep 2014 13:48:27 GMT
See <https://builds.apache.org/job/Hadoop-Hdfs-trunk/1875/changes>

Changes:

[tucu] HADOOP-11099. KMS return HTTP UNAUTHORIZED 401 on ACL failure. (tucu)

[tucu] HADOOP-11016. KMS should support signing cookies with zookeeper secret manager. (tucu)

[tucu] HADOOP-10982

[tucu] Revert "HADOOP-10982"

[tucu] Revert "HADOOP-11016. KMS should support signing cookies with zookeeper secret manager.
(tucu)"

[wang] HDFS-6705. Create an XAttr that disallows the HDFS admin from accessing a file. (clamb
via wang)

[cmccabe] HDFS-6843. Create FileStatus isEncrypted() method (clamb via cmccabe)

[cmccabe] HDFS-6843. Add to CHANGES.txt

[cmccabe] HDFS-7075. hadoop-fuse-dfs fails because it cannot find JavaKeyStoreProvider$Factory.
(cmccabe)

[jianhe] YARN-2558. Updated ContainerTokenIdentifier#read/write to use ContainerId#getContainerId.
Contributed by Tsuyoshi OZAWA.

[tucu] HADOOP-11016. KMS should support signing cookies with zookeeper secret manager. (tucu)

[wang] HADOOP-11040. Return value of read(ByteBuffer buf) in CryptoInputStream is incorrect
in some cases. (Yi Liu via wang)

[wang] Move some HDFS JIRAs to the correct CHANGES.txt

[wang] HDFS-7004. Update KeyProvider instantiation to create by URI. (wang)

[wang] HDFS-7078. Fix listEZs to work correctly with snapshots. (wang)

[jianhe] YARN-2559. Fixed NPE in SystemMetricsPublisher when retrieving FinalApplicationStatus.
Contributed by Zhijie Shen

------------------------------------------
[...truncated 5842 lines...]
Running org.apache.hadoop.hdfs.protocol.TestAnnotations
Tests run: 1, Failures: 0, Errors: 0, Skipped: 0, Time elapsed: 0.128 sec - in org.apache.hadoop.hdfs.protocol.TestAnnotations
Running org.apache.hadoop.hdfs.protocol.TestLayoutVersion
Tests run: 6, Failures: 0, Errors: 0, Skipped: 0, Time elapsed: 0.082 sec - in org.apache.hadoop.hdfs.protocol.TestLayoutVersion
Running org.apache.hadoop.hdfs.protocol.datatransfer.sasl.TestSaslDataTransfer
Tests run: 6, Failures: 0, Errors: 0, Skipped: 0, Time elapsed: 22.587 sec - in org.apache.hadoop.hdfs.protocol.datatransfer.sasl.TestSaslDataTransfer
Running org.apache.hadoop.hdfs.protocol.datatransfer.TestPacketReceiver
Tests run: 1, Failures: 0, Errors: 0, Skipped: 0, Time elapsed: 0.365 sec - in org.apache.hadoop.hdfs.protocol.datatransfer.TestPacketReceiver
Running org.apache.hadoop.hdfs.TestDatanodeRegistration
Tests run: 5, Failures: 0, Errors: 0, Skipped: 0, Time elapsed: 7.703 sec - in org.apache.hadoop.hdfs.TestDatanodeRegistration
Running org.apache.hadoop.hdfs.TestDFSUpgradeFromImage
Tests run: 7, Failures: 0, Errors: 0, Skipped: 0, Time elapsed: 11.849 sec - in org.apache.hadoop.hdfs.TestDFSUpgradeFromImage
Running org.apache.hadoop.hdfs.TestReadWhileWriting
Tests run: 1, Failures: 0, Errors: 0, Skipped: 0, Time elapsed: 6.208 sec - in org.apache.hadoop.hdfs.TestReadWhileWriting
Running org.apache.hadoop.hdfs.TestDFSStartupVersions
Tests run: 1, Failures: 0, Errors: 0, Skipped: 0, Time elapsed: 10.108 sec - in org.apache.hadoop.hdfs.TestDFSStartupVersions
Running org.apache.hadoop.hdfs.TestDefaultNameNodePort
Tests run: 3, Failures: 0, Errors: 0, Skipped: 0, Time elapsed: 0.86 sec - in org.apache.hadoop.hdfs.TestDefaultNameNodePort
Running org.apache.hadoop.hdfs.TestFSInputChecker
Tests run: 1, Failures: 0, Errors: 0, Skipped: 0, Time elapsed: 3.653 sec - in org.apache.hadoop.hdfs.TestFSInputChecker
Running org.apache.hadoop.hdfs.TestDFSRollback
Tests run: 1, Failures: 0, Errors: 0, Skipped: 0, Time elapsed: 13.604 sec - in org.apache.hadoop.hdfs.TestDFSRollback
Running org.apache.hadoop.hdfs.crypto.TestHdfsCryptoStreams
Tests run: 14, Failures: 0, Errors: 0, Skipped: 0, Time elapsed: 26.717 sec - in org.apache.hadoop.hdfs.crypto.TestHdfsCryptoStreams
Running org.apache.hadoop.hdfs.TestSafeMode
Tests run: 7, Failures: 0, Errors: 0, Skipped: 0, Time elapsed: 35.06 sec - in org.apache.hadoop.hdfs.TestSafeMode
Running org.apache.hadoop.hdfs.tools.TestDFSAdminWithHA
Tests run: 10, Failures: 0, Errors: 0, Skipped: 0, Time elapsed: 16.809 sec - in org.apache.hadoop.hdfs.tools.TestDFSAdminWithHA
Running org.apache.hadoop.hdfs.tools.offlineImageViewer.TestOfflineImageViewerForAcl
Tests run: 1, Failures: 0, Errors: 0, Skipped: 0, Time elapsed: 3.65 sec - in org.apache.hadoop.hdfs.tools.offlineImageViewer.TestOfflineImageViewerForAcl
Running org.apache.hadoop.hdfs.tools.offlineImageViewer.TestOfflineImageViewer
Tests run: 5, Failures: 0, Errors: 0, Skipped: 0, Time elapsed: 4.226 sec - in org.apache.hadoop.hdfs.tools.offlineImageViewer.TestOfflineImageViewer
Running org.apache.hadoop.hdfs.tools.TestDFSHAAdmin
Tests run: 20, Failures: 0, Errors: 0, Skipped: 0, Time elapsed: 1.981 sec - in org.apache.hadoop.hdfs.tools.TestDFSHAAdmin
Running org.apache.hadoop.hdfs.tools.TestGetConf
Tests run: 10, Failures: 0, Errors: 0, Skipped: 0, Time elapsed: 1.135 sec - in org.apache.hadoop.hdfs.tools.TestGetConf
Running org.apache.hadoop.hdfs.tools.TestDFSHAAdminMiniCluster
Tests run: 6, Failures: 0, Errors: 0, Skipped: 0, Time elapsed: 6.582 sec - in org.apache.hadoop.hdfs.tools.TestDFSHAAdminMiniCluster
Running org.apache.hadoop.hdfs.tools.offlineEditsViewer.TestOfflineEditsViewer
Tests run: 3, Failures: 0, Errors: 0, Skipped: 0, Time elapsed: 11.29 sec - in org.apache.hadoop.hdfs.tools.offlineEditsViewer.TestOfflineEditsViewer
Running org.apache.hadoop.hdfs.tools.TestGetGroups
Tests run: 6, Failures: 0, Errors: 0, Skipped: 0, Time elapsed: 4.344 sec - in org.apache.hadoop.hdfs.tools.TestGetGroups
Running org.apache.hadoop.hdfs.tools.TestDelegationTokenFetcher
Tests run: 2, Failures: 0, Errors: 0, Skipped: 0, Time elapsed: 1.047 sec - in org.apache.hadoop.hdfs.tools.TestDelegationTokenFetcher
Running org.apache.hadoop.hdfs.TestCrcCorruption
Tests run: 4, Failures: 0, Errors: 0, Skipped: 0, Time elapsed: 13.637 sec - in org.apache.hadoop.hdfs.TestCrcCorruption
Running org.apache.hadoop.hdfs.TestDFSRename
Tests run: 2, Failures: 0, Errors: 0, Skipped: 0, Time elapsed: 10.179 sec - in org.apache.hadoop.hdfs.TestDFSRename
Running org.apache.hadoop.hdfs.TestLargeBlock
Tests run: 1, Failures: 0, Errors: 0, Skipped: 0, Time elapsed: 12.968 sec - in org.apache.hadoop.hdfs.TestLargeBlock
Running org.apache.hadoop.hdfs.TestDatanodeConfig
Tests run: 2, Failures: 0, Errors: 0, Skipped: 0, Time elapsed: 4.255 sec - in org.apache.hadoop.hdfs.TestDatanodeConfig
Running org.apache.hadoop.hdfs.TestWriteConfigurationToDFS
Tests run: 1, Failures: 0, Errors: 0, Skipped: 0, Time elapsed: 4.597 sec - in org.apache.hadoop.hdfs.TestWriteConfigurationToDFS
Running org.apache.hadoop.hdfs.TestFileAppend2
Tests run: 2, Failures: 0, Errors: 0, Skipped: 0, Time elapsed: 14.424 sec - in org.apache.hadoop.hdfs.TestFileAppend2
Running org.apache.hadoop.hdfs.protocolPB.TestPBHelper
Tests run: 28, Failures: 0, Errors: 0, Skipped: 0, Time elapsed: 0.799 sec - in org.apache.hadoop.hdfs.protocolPB.TestPBHelper
Running org.apache.hadoop.hdfs.TestSetrepIncreasing
Tests run: 2, Failures: 0, Errors: 0, Skipped: 0, Time elapsed: 27.004 sec - in org.apache.hadoop.hdfs.TestSetrepIncreasing
Running org.apache.hadoop.hdfs.TestDFSClientRetries
Tests run: 10, Failures: 0, Errors: 0, Skipped: 0, Time elapsed: 136.056 sec - in org.apache.hadoop.hdfs.TestDFSClientRetries
Running org.apache.hadoop.hdfs.TestBlockReaderLocal
Tests run: 37, Failures: 0, Errors: 0, Skipped: 0, Time elapsed: 27.089 sec - in org.apache.hadoop.hdfs.TestBlockReaderLocal
Running org.apache.hadoop.hdfs.TestHdfsAdmin
Tests run: 2, Failures: 0, Errors: 0, Skipped: 0, Time elapsed: 3.548 sec - in org.apache.hadoop.hdfs.TestHdfsAdmin
Running org.apache.hadoop.hdfs.TestDataTransferKeepalive
Tests run: 4, Failures: 0, Errors: 0, Skipped: 0, Time elapsed: 14.538 sec - in org.apache.hadoop.hdfs.TestDataTransferKeepalive
Running org.apache.hadoop.hdfs.TestEncryptedTransfer
Tests run: 24, Failures: 0, Errors: 0, Skipped: 0, Time elapsed: 98.528 sec - in org.apache.hadoop.hdfs.TestEncryptedTransfer
Running org.apache.hadoop.hdfs.TestDatanodeDeath
Tests run: 4, Failures: 0, Errors: 0, Skipped: 0, Time elapsed: 148.325 sec - in org.apache.hadoop.hdfs.TestDatanodeDeath
Running org.apache.hadoop.hdfs.TestHDFSFileSystemContract
Tests run: 44, Failures: 0, Errors: 0, Skipped: 0, Time elapsed: 41.661 sec - in org.apache.hadoop.hdfs.TestHDFSFileSystemContract
Running org.apache.hadoop.hdfs.TestHFlush
Tests run: 9, Failures: 0, Errors: 0, Skipped: 0, Time elapsed: 22.597 sec - in org.apache.hadoop.hdfs.TestHFlush
Running org.apache.hadoop.hdfs.TestDisableConnCache
Tests run: 1, Failures: 0, Errors: 0, Skipped: 0, Time elapsed: 3.389 sec - in org.apache.hadoop.hdfs.TestDisableConnCache
Running org.apache.hadoop.hdfs.TestParallelUnixDomainRead
Tests run: 4, Failures: 0, Errors: 0, Skipped: 0, Time elapsed: 42.563 sec - in org.apache.hadoop.hdfs.TestParallelUnixDomainRead
Running org.apache.hadoop.hdfs.TestClientProtocolForPipelineRecovery
Tests run: 4, Failures: 0, Errors: 0, Skipped: 0, Time elapsed: 32.385 sec - in org.apache.hadoop.hdfs.TestClientProtocolForPipelineRecovery
Running org.apache.hadoop.hdfs.TestDFSClientExcludedNodes
Tests run: 2, Failures: 0, Errors: 0, Skipped: 0, Time elapsed: 9.974 sec - in org.apache.hadoop.hdfs.TestDFSClientExcludedNodes
Running org.apache.hadoop.hdfs.TestDatanodeReport
Tests run: 1, Failures: 0, Errors: 0, Skipped: 0, Time elapsed: 19.799 sec - in org.apache.hadoop.hdfs.TestDatanodeReport
Running org.apache.hadoop.hdfs.TestBlockReaderFactory
Tests run: 7, Failures: 0, Errors: 0, Skipped: 0, Time elapsed: 9.601 sec - in org.apache.hadoop.hdfs.TestBlockReaderFactory
Running org.apache.hadoop.hdfs.TestMiniDFSCluster
Tests run: 4, Failures: 0, Errors: 0, Skipped: 0, Time elapsed: 5.441 sec - in org.apache.hadoop.hdfs.TestMiniDFSCluster
Running org.apache.hadoop.hdfs.TestBlocksScheduledCounter
Tests run: 1, Failures: 0, Errors: 0, Skipped: 0, Time elapsed: 3.439 sec - in org.apache.hadoop.hdfs.TestBlocksScheduledCounter
Running org.apache.hadoop.hdfs.TestDFSStorageStateRecovery
Tests run: 3, Failures: 0, Errors: 0, Skipped: 0, Time elapsed: 71.358 sec - in org.apache.hadoop.hdfs.TestDFSStorageStateRecovery
Running org.apache.hadoop.hdfs.TestSnapshotCommands
Tests run: 6, Failures: 0, Errors: 0, Skipped: 0, Time elapsed: 3.76 sec - in org.apache.hadoop.hdfs.TestSnapshotCommands
Running org.apache.hadoop.hdfs.TestParallelShortCircuitRead
Tests run: 4, Failures: 0, Errors: 0, Skipped: 0, Time elapsed: 14.771 sec - in org.apache.hadoop.hdfs.TestParallelShortCircuitRead
Running org.apache.hadoop.hdfs.TestDFSPermission
Tests run: 7, Failures: 0, Errors: 0, Skipped: 0, Time elapsed: 18.424 sec - in org.apache.hadoop.hdfs.TestDFSPermission
Running org.apache.hadoop.hdfs.TestParallelRead
Tests run: 4, Failures: 0, Errors: 0, Skipped: 0, Time elapsed: 39.551 sec - in org.apache.hadoop.hdfs.TestParallelRead
Running org.apache.hadoop.hdfs.TestRollingUpgradeRollback
Tests run: 3, Failures: 0, Errors: 0, Skipped: 0, Time elapsed: 9.216 sec - in org.apache.hadoop.hdfs.TestRollingUpgradeRollback
Running org.apache.hadoop.hdfs.TestRollingUpgradeDowngrade
Tests run: 2, Failures: 0, Errors: 0, Skipped: 0, Time elapsed: 6.957 sec - in org.apache.hadoop.hdfs.TestRollingUpgradeDowngrade
Running org.apache.hadoop.hdfs.TestDFSUtil
Tests run: 30, Failures: 0, Errors: 0, Skipped: 0, Time elapsed: 3.052 sec - in org.apache.hadoop.hdfs.TestDFSUtil
Running org.apache.hadoop.hdfs.TestDeprecatedKeys
Tests run: 1, Failures: 0, Errors: 0, Skipped: 0, Time elapsed: 0.476 sec - in org.apache.hadoop.hdfs.TestDeprecatedKeys
Running org.apache.hadoop.hdfs.TestGetBlocks
Tests run: 3, Failures: 0, Errors: 0, Skipped: 0, Time elapsed: 38.952 sec - in org.apache.hadoop.hdfs.TestGetBlocks
Running org.apache.hadoop.hdfs.TestRead
Tests run: 3, Failures: 0, Errors: 0, Skipped: 0, Time elapsed: 4.724 sec - in org.apache.hadoop.hdfs.TestRead
Running org.apache.hadoop.hdfs.TestParallelReadUtil
Tests run: 1, Failures: 0, Errors: 0, Skipped: 1, Time elapsed: 0.031 sec - in org.apache.hadoop.hdfs.TestParallelReadUtil
Running org.apache.hadoop.hdfs.shortcircuit.TestShortCircuitShm
Tests run: 2, Failures: 0, Errors: 0, Skipped: 0, Time elapsed: 0.47 sec - in org.apache.hadoop.hdfs.shortcircuit.TestShortCircuitShm
Running org.apache.hadoop.hdfs.shortcircuit.TestShortCircuitCache
Tests run: 8, Failures: 0, Errors: 0, Skipped: 0, Time elapsed: 7.9 sec - in org.apache.hadoop.hdfs.shortcircuit.TestShortCircuitCache
Running org.apache.hadoop.hdfs.shortcircuit.TestShortCircuitLocalRead
Tests run: 11, Failures: 0, Errors: 0, Skipped: 0, Time elapsed: 13.957 sec - in org.apache.hadoop.hdfs.shortcircuit.TestShortCircuitLocalRead
Running org.apache.hadoop.hdfs.TestMultiThreadedHflush
Tests run: 3, Failures: 0, Errors: 0, Skipped: 0, Time elapsed: 7.399 sec - in org.apache.hadoop.hdfs.TestMultiThreadedHflush
Running org.apache.hadoop.hdfs.TestEncryptionZonesWithKMS
Tests run: 16, Failures: 0, Errors: 0, Skipped: 0, Time elapsed: 45.974 sec - in org.apache.hadoop.hdfs.TestEncryptionZonesWithKMS
Running org.apache.hadoop.hdfs.TestFileLengthOnClusterRestart
Tests run: 1, Failures: 0, Errors: 0, Skipped: 0, Time elapsed: 9.519 sec - in org.apache.hadoop.hdfs.TestFileLengthOnClusterRestart
Running org.apache.hadoop.hdfs.TestBlockMissingException
Tests run: 1, Failures: 0, Errors: 0, Skipped: 0, Time elapsed: 3.805 sec - in org.apache.hadoop.hdfs.TestBlockMissingException
Running org.apache.hadoop.hdfs.TestReplication
Tests run: 6, Failures: 0, Errors: 0, Skipped: 0, Time elapsed: 30.336 sec - in org.apache.hadoop.hdfs.TestReplication
Running org.apache.hadoop.hdfs.TestFileAppend
Tests run: 7, Failures: 0, Errors: 0, Skipped: 0, Time elapsed: 13.376 sec - in org.apache.hadoop.hdfs.TestFileAppend
Running org.apache.hadoop.hdfs.TestDistributedFileSystem
Tests run: 16, Failures: 0, Errors: 0, Skipped: 0, Time elapsed: 44.402 sec - in org.apache.hadoop.hdfs.TestDistributedFileSystem
Running org.apache.hadoop.hdfs.TestClientBlockVerification
Tests run: 4, Failures: 0, Errors: 0, Skipped: 0, Time elapsed: 4.035 sec - in org.apache.hadoop.hdfs.TestClientBlockVerification
Running org.apache.hadoop.hdfs.TestReservedRawPaths
Tests run: 8, Failures: 0, Errors: 0, Skipped: 0, Time elapsed: 7.936 sec - in org.apache.hadoop.hdfs.TestReservedRawPaths
Running org.apache.hadoop.hdfs.TestMissingBlocksAlert
Tests run: 1, Failures: 0, Errors: 0, Skipped: 0, Time elapsed: 3.546 sec - in org.apache.hadoop.hdfs.TestMissingBlocksAlert
Running org.apache.hadoop.hdfs.TestClose
Tests run: 1, Failures: 0, Errors: 0, Skipped: 0, Time elapsed: 3.338 sec - in org.apache.hadoop.hdfs.TestClose
Running org.apache.hadoop.hdfs.TestFileConcurrentReader
Tests run: 7, Failures: 0, Errors: 0, Skipped: 0, Time elapsed: 22.721 sec - in org.apache.hadoop.hdfs.TestFileConcurrentReader
Running org.apache.hadoop.hdfs.TestHDFSServerPorts
Tests run: 4, Failures: 0, Errors: 0, Skipped: 0, Time elapsed: 5.201 sec - in org.apache.hadoop.hdfs.TestHDFSServerPorts
Running org.apache.hadoop.tracing.TestTracing
Tests run: 5, Failures: 0, Errors: 0, Skipped: 0, Time elapsed: 4.275 sec - in org.apache.hadoop.tracing.TestTracing
Running org.apache.hadoop.tracing.TestTracingShortCircuitLocalRead
Tests run: 1, Failures: 0, Errors: 0, Skipped: 0, Time elapsed: 3.584 sec - in org.apache.hadoop.tracing.TestTracingShortCircuitLocalRead

Results :

Failed tests: 
  TestCacheDirectives.testExceedsCapacity:1443->checkPendingCachedEmpty:1420 Pending cached
list of 127.0.0.1:42414 is not empty, [{blockId=1073741841, replication=1, mark=false}]

Tests run: 3055, Failures: 1, Errors: 0, Skipped: 18

[INFO]                                                                         
[INFO] ------------------------------------------------------------------------
[INFO] Skipping Apache Hadoop HttpFS
[INFO] This project has been banned from the build due to previous failures.
[INFO] ------------------------------------------------------------------------
[INFO]                                                                         
[INFO] ------------------------------------------------------------------------
[INFO] Skipping Apache Hadoop HDFS BookKeeper Journal
[INFO] This project has been banned from the build due to previous failures.
[INFO] ------------------------------------------------------------------------
[INFO]                                                                         
[INFO] ------------------------------------------------------------------------
[INFO] Skipping Apache Hadoop HDFS-NFS
[INFO] This project has been banned from the build due to previous failures.
[INFO] ------------------------------------------------------------------------
[INFO]                                                                         
[INFO] ------------------------------------------------------------------------
[INFO] Building Apache Hadoop HDFS Project 3.0.0-SNAPSHOT
[INFO] ------------------------------------------------------------------------
[WARNING] The POM for org.eclipse.m2e:lifecycle-mapping:jar:1.0.0 is missing, no dependency
information available
[WARNING] Failed to retrieve plugin descriptor for org.eclipse.m2e:lifecycle-mapping:1.0.0:
Plugin org.eclipse.m2e:lifecycle-mapping:1.0.0 or one of its dependencies could not be resolved:
Failure to find org.eclipse.m2e:lifecycle-mapping:jar:1.0.0 in http://repo.maven.apache.org/maven2
was cached in the local repository, resolution will not be reattempted until the update interval
of central has elapsed or updates are forced
[INFO] 
[INFO] --- maven-clean-plugin:2.4.1:clean (default-clean) @ hadoop-hdfs-project ---
[INFO] Deleting <https://builds.apache.org/job/Hadoop-Hdfs-trunk/ws/hadoop-hdfs-project/target>
[INFO] 
[INFO] --- maven-antrun-plugin:1.7:run (create-testdirs) @ hadoop-hdfs-project ---
[INFO] Executing tasks

main:
    [mkdir] Created dir: <https://builds.apache.org/job/Hadoop-Hdfs-trunk/ws/hadoop-hdfs-project/target/test-dir>
[INFO] Executed tasks
[INFO] 
[INFO] --- maven-source-plugin:2.1.2:jar-no-fork (hadoop-java-sources) @ hadoop-hdfs-project
---
[INFO] 
[INFO] --- maven-source-plugin:2.1.2:test-jar-no-fork (hadoop-java-sources) @ hadoop-hdfs-project
---
[INFO] 
[INFO] --- maven-enforcer-plugin:1.3.1:enforce (dist-enforce) @ hadoop-hdfs-project ---
[INFO] 
[INFO] --- maven-site-plugin:3.3:attach-descriptor (attach-descriptor) @ hadoop-hdfs-project
---
[INFO] 
[INFO] --- maven-javadoc-plugin:2.8.1:jar (module-javadocs) @ hadoop-hdfs-project ---
[INFO] Not executing Javadoc as the project is not a Java classpath-capable package
[INFO] 
[INFO] --- maven-enforcer-plugin:1.3.1:enforce (depcheck) @ hadoop-hdfs-project ---
[INFO] 
[INFO] --- maven-checkstyle-plugin:2.6:checkstyle (default-cli) @ hadoop-hdfs-project ---
[INFO] 
[INFO] --- findbugs-maven-plugin:2.3.2:findbugs (default-cli) @ hadoop-hdfs-project ---
[INFO] ****** FindBugsMojo execute *******
[INFO] canGenerate is false
[INFO] ------------------------------------------------------------------------
[INFO] Reactor Summary:
[INFO] 
[INFO] Apache Hadoop HDFS ................................ FAILURE [  02:10 h]
[INFO] Apache Hadoop HttpFS .............................. SKIPPED
[INFO] Apache Hadoop HDFS BookKeeper Journal ............. SKIPPED
[INFO] Apache Hadoop HDFS-NFS ............................ SKIPPED
[INFO] Apache Hadoop HDFS Project ........................ SUCCESS [  2.193 s]
[INFO] ------------------------------------------------------------------------
[INFO] BUILD FAILURE
[INFO] ------------------------------------------------------------------------
[INFO] Total time: 02:10 h
[INFO] Finished at: 2014-09-18T13:46:39+00:00
[INFO] Final Memory: 65M/867M
[INFO] ------------------------------------------------------------------------
[ERROR] Failed to execute goal org.apache.maven.plugins:maven-surefire-plugin:2.16:test (default-test)
on project hadoop-hdfs: There are test failures.
[ERROR] 
[ERROR] Please refer to <https://builds.apache.org/job/Hadoop-Hdfs-trunk/ws/hadoop-hdfs-project/hadoop-hdfs/target/surefire-reports>
for the individual test results.
[ERROR] -> [Help 1]
[ERROR] 
[ERROR] To see the full stack trace of the errors, re-run Maven with the -e switch.
[ERROR] Re-run Maven using the -X switch to enable full debug logging.
[ERROR] 
[ERROR] For more information about the errors and possible solutions, please read the following
articles:
[ERROR] [Help 1] http://cwiki.apache.org/confluence/display/MAVEN/MojoFailureException
Build step 'Execute shell' marked build as failure
Archiving artifacts
Recording test results
Updating HDFS-6705
Updating YARN-2558
Updating HADOOP-11040
Updating HDFS-6843
Updating HDFS-7075
Updating HADOOP-11016
Updating YARN-2559
Updating HDFS-7078
Updating HDFS-7004
Updating HADOOP-10982
Updating HADOOP-11099

Mime
View raw message