hadoop-hdfs-dev mailing list archives

Site index · List index
Message view « Date » · « Thread »
Top « Date » · « Thread »
From Apache Jenkins Server <jenk...@builds.apache.org>
Subject Build failed in Jenkins: Hadoop-Hdfs-trunk #1829
Date Wed, 06 Aug 2014 13:02:25 GMT
See <https://builds.apache.org/job/Hadoop-Hdfs-trunk/1829/changes>

Changes:

[junping_du] YARN-2298. Move TimelineClient to yarn-common project (Contributed by Zhijie
Shen)

[brandonli] HDFS-6790. DFSUtil Should Use configuration.getPassword for SSL passwords. Contributed
by Larry McCay

[brandonli] HADOOP-10905. LdapGroupsMapping Should use configuration.getPassword for SSL and
LDAP Passwords. Contributed by Larry McCay

[kasha] Edit CHANGES.txt files to move HADOOP-10759 and HDFS-6717 from 2.5.0 to 2.6.0

[wang] HADOOP-10939. Fix TestKeyProviderFactory testcases to use default 128 bit length keys.
Contributed by Arun Suresh.

[jlowe] MAPREDUCE-6014. New task status field in task attempts table can lead to an empty
web page. Contributed by Mit Desai

[tucu] HADOOP-10933. FileBasedKeyStoresFactory Should use Configuration.getPassword for SSL
Passwords. (lmccay via tucu)

[tucu] HADOOP-10791. AuthenticationFilter should support externalizing the secret for signing
and provide rotation support. (rkanter via tucu)

[tucu] HADOOP-10918. JMXJsonServlet fails when used within Tomcat. (tucu)

------------------------------------------
[...truncated 30166 lines...]
  TestHDFSFileSystemContract.setUp:39 ? UnknownHost asf901.ygridcore.net: asf901...
  TestHDFSFileSystemContract.setUp:39 ? UnknownHost asf901.ygridcore.net: asf901...
  TestHDFSFileSystemContract.setUp:39 ? UnknownHost asf901.ygridcore.net: asf901...
  TestHDFSFileSystemContract.setUp:39 ? UnknownHost asf901.ygridcore.net: asf901...
  TestHDFSFileSystemContract.setUp:39 ? UnknownHost asf901.ygridcore.net: asf901...
  TestHDFSFileSystemContract.setUp:39 ? UnknownHost asf901.ygridcore.net: asf901...
  TestHDFSFileSystemContract.setUp:39 ? UnknownHost asf901.ygridcore.net: asf901...
  TestHDFSFileSystemContract.setUp:39 ? UnknownHost asf901.ygridcore.net: asf901...
  TestHDFSFileSystemContract.setUp:39 ? UnknownHost asf901.ygridcore.net: asf901...
  TestHDFSFileSystemContract.setUp:39 ? UnknownHost asf901.ygridcore.net: asf901...
  TestHDFSFileSystemContract.setUp:39 ? UnknownHost asf901.ygridcore.net: asf901...
  TestHDFSFileSystemContract.setUp:39 ? UnknownHost asf901.ygridcore.net: asf901...
  TestHDFSFileSystemContract.setUp:39 ? UnknownHost asf901.ygridcore.net: asf901...
  TestHDFSFileSystemContract.setUp:39 ? UnknownHost asf901.ygridcore.net: asf901...
  TestHDFSFileSystemContract.setUp:39 ? UnknownHost asf901.ygridcore.net: asf901...
  TestHDFSFileSystemContract.setUp:39 ? UnknownHost asf901.ygridcore.net: asf901...
  TestHDFSFileSystemContract.setUp:39 ? UnknownHost asf901.ygridcore.net: asf901...
  TestHDFSFileSystemContract.setUp:39 ? UnknownHost asf901.ygridcore.net: asf901...
  TestHDFSFileSystemContract.setUp:39 ? UnknownHost asf901.ygridcore.net: asf901...
  TestHDFSFileSystemContract.setUp:39 ? UnknownHost asf901.ygridcore.net: asf901...
  TestHDFSFileSystemContract.setUp:39 ? UnknownHost asf901.ygridcore.net: asf901...
  TestHDFSFileSystemContract.setUp:39 ? UnknownHost asf901.ygridcore.net: asf901...
  TestHDFSFileSystemContract.setUp:39 ? UnknownHost asf901.ygridcore.net: asf901...
  TestHDFSFileSystemContract.setUp:39 ? UnknownHost asf901.ygridcore.net: asf901...
  TestHDFSFileSystemContract.setUp:39 ? UnknownHost asf901.ygridcore.net: asf901...
  TestHDFSFileSystemContract.setUp:39 ? UnknownHost asf901.ygridcore.net: asf901...
  TestHDFSFileSystemContract.setUp:39 ? UnknownHost asf901.ygridcore.net: asf901...
  TestHDFSFileSystemContract.setUp:39 ? UnknownHost asf901.ygridcore.net: asf901...
  TestHDFSFileSystemContract.setUp:39 ? UnknownHost asf901.ygridcore.net: asf901...
  TestHDFSFileSystemContract.setUp:39 ? UnknownHost asf901.ygridcore.net: asf901...
  TestHDFSFileSystemContract.setUp:39 ? UnknownHost asf901.ygridcore.net: asf901...
  TestHDFSFileSystemContract.setUp:39 ? UnknownHost asf901.ygridcore.net: asf901...
  TestHDFSFileSystemContract.setUp:39 ? UnknownHost asf901.ygridcore.net: asf901...
  TestHDFSFileSystemContract.setUp:39 ? UnknownHost asf901.ygridcore.net: asf901...
  TestHDFSFileSystemContract.setUp:39 ? UnknownHost asf901.ygridcore.net: asf901...
  TestHDFSFileSystemContract.setUp:39 ? UnknownHost asf901.ygridcore.net: asf901...
  TestHDFSFileSystemContract.setUp:39 ? UnknownHost asf901.ygridcore.net: asf901...
  TestHDFSFileSystemContract.setUp:39 ? UnknownHost asf901.ygridcore.net: asf901...
  TestHDFSFileSystemContract.setUp:39 ? UnknownHost asf901.ygridcore.net: asf901...
  TestHDFSFileSystemContract.setUp:39 ? UnknownHost asf901.ygridcore.net: asf901...
  TestHDFSFileSystemContract.setUp:39 ? UnknownHost asf901.ygridcore.net: asf901...
  TestHDFSFileSystemContract.setUp:39 ? UnknownHost asf901.ygridcore.net: asf901...
  TestHFlush.hSyncUpdateLength_00:104 ? UnknownHost asf901.ygridcore.net: asf901...
  TestHFlush.hSyncUpdateLength_01:132->doTheJob:197 ? UnknownHost asf901.ygridco...
  TestHFlush.hSyncUpdateLength_02:152->doTheJob:197 ? UnknownHost asf901.ygridco...
  TestHFlush.hSyncUpdateLength_03:173->doTheJob:197 ? UnknownHost asf901.ygridco...
  TestHFlush.hFlush_01:55->doTheJob:197 ? UnknownHost asf901.ygridcore.net: asf9...
  TestHFlush.hFlush_02:74->doTheJob:197 ? UnknownHost asf901.ygridcore.net: asf9...
  TestHFlush.hFlush_03:93->doTheJob:197 ? UnknownHost asf901.ygridcore.net: asf9...
  TestHFlush.testHFlushInterrupted:329 ? UnknownHost asf901.ygridcore.net: asf90...
  TestHFlush.testPipelineHeartbeat:279 ? UnknownHost asf901.ygridcore.net: asf90...
  TestDisableConnCache.testDisableCache:50 ? UnknownHost asf901.ygridcore.net: a...
  TestParallelUnixDomainRead.setupCluster:44->TestParallelReadUtil.setupCluster:71 ? UnknownHost
  TestParallelUnixDomainRead.teardownCluster:56->TestParallelReadUtil.teardownCluster:394
? NullPointer
  TestClientProtocolForPipelineRecovery.testGetNewStamp:47 ? UnknownHost asf901....
  TestClientProtocolForPipelineRecovery.testPipelineRecoveryForLastBlock:138 ? UnknownHost
  TestClientProtocolForPipelineRecovery.testPipelineRecoveryOnRestartFailure:216 ? UnknownHost
  TestClientProtocolForPipelineRecovery.testPipelineRecoveryOnOOB:178 ? UnknownHost
  TestDFSClientExcludedNodes.testExcludedNodes:63 ? UnknownHost asf901.ygridcore...
  TestDFSClientExcludedNodes.testExcludedNodesForgiveness:95 ? UnknownHost asf90...
  TestDatanodeReport.testDatanodeReport:55 ? UnknownHost asf901.ygridcore.net: a...
  TestBlockReaderFactory.testShortCircuitCacheTemporaryFailure:231 ? UnknownHost
  TestBlockReaderFactory.testShortCircuitCacheShutdown:394 ? UnknownHost asf901....
  TestBlockReaderFactory.testMultipleWaitersOnShortCircuitCache:160 ? UnknownHost
  TestBlockReaderFactory.testShortCircuitReadFromServerWithoutShm:314 ? UnknownHost
  TestBlockReaderFactory.testShortCircuitReadFromClientWithoutShm:359 ? UnknownHost
  TestBlockReaderFactory.testPurgingClosedReplicas:450 ? UnknownHost asf901.ygri...
  TestBlockReaderFactory.testFallbackFromShortCircuitToUnixDomainTraffic:113 ? UnknownHost
  TestMiniDFSCluster.testDualClusters:85 ? UnknownHost asf901.ygridcore.net: asf...
  TestMiniDFSCluster.testClusterSetDatanodeHostname:131 ? UnknownHost asf901.ygr...
  TestMiniDFSCluster.testIsClusterUpAfterShutdown:110 ? UnknownHost asf901.ygrid...
  TestMiniDFSCluster.testClusterWithoutSystemProperties:65 ? UnknownHost asf901....
  TestBlocksScheduledCounter.testBlocksScheduledCounter:41 ? UnknownHost asf901....
  TestDFSStorageStateRecovery.setUp:449 ? UnknownHost asf901.ygridcore.net: asf9...
  TestDFSStorageStateRecovery.setUp:449 ? UnknownHost asf901.ygridcore.net: asf9...
  TestDFSStorageStateRecovery.setUp:449 ? UnknownHost asf901.ygridcore.net: asf9...
  TestSnapshotCommands.clusterSetUp:56 ? UnknownHost asf901.ygridcore.net: asf90...
  TestParallelShortCircuitRead.setupCluster:45->TestParallelReadUtil.setupCluster:71 ?
UnknownHost
  TestParallelShortCircuitRead.teardownCluster:57->TestParallelReadUtil.teardownCluster:394
? NullPointer
  TestDFSPermission.setUp:117 ? UnknownHost asf901.ygridcore.net: asf901.ygridco...
  TestDFSPermission.setUp:117 ? UnknownHost asf901.ygridcore.net: asf901.ygridco...
  TestDFSPermission.setUp:117 ? UnknownHost asf901.ygridcore.net: asf901.ygridco...
  TestDFSPermission.setUp:117 ? UnknownHost asf901.ygridcore.net: asf901.ygridco...
  TestDFSPermission.setUp:117 ? UnknownHost asf901.ygridcore.net: asf901.ygridco...
  TestDFSPermission.setUp:117 ? UnknownHost asf901.ygridcore.net: asf901.ygridco...
  TestDFSPermission.setUp:117 ? UnknownHost asf901.ygridcore.net: asf901.ygridco...
  TestParallelRead.setupCluster:39->TestParallelReadUtil.setupCluster:71 ? UnknownHost
  TestParallelRead.teardownCluster:44->TestParallelReadUtil.teardownCluster:394 ? NullPointer
  TestRollingUpgradeRollback.testRollbackWithHAQJM:210 ? UnknownHost asf901.ygri...
  TestRollingUpgradeDowngrade.testDowngrade:47 ? UnknownHost asf901.ygridcore.ne...
  TestGetBlocks.testReadSelectNonStaleDatanode:95 ? UnknownHost asf901.ygridcore...
  TestGetBlocks.testGetBlocks:186 ? UnknownHost asf901.ygridcore.net: asf901.ygr...
  TestRead.testEOFWithBlockReaderLocal:61 ? UnknownHost asf901.ygridcore.net: as...
  TestRead.testEOFWithRemoteBlockReader:76 ? UnknownHost asf901.ygridcore.net: a...
  TestShortCircuitCache.testUnlinkingReplicasInFileDescriptorCache:539 ? UnknownHost
  TestShortCircuitCache.testAllocShm:407 ? UnknownHost asf901.ygridcore.net: asf...
  TestShortCircuitCache.testShmBasedStaleness:476 ? UnknownHost asf901.ygridcore...
  TestShortCircuitLocalRead.testReadFromAnOffset:330->doTestShortCircuitRead:238->doTestShortCircuitReadImpl:268
? UnknownHost
  TestShortCircuitLocalRead.testSkipWithVerifyChecksum:395 ? UnknownHost asf901....
  TestShortCircuitLocalRead.testSmallFileLocalRead:306->doTestShortCircuitRead:238->doTestShortCircuitReadImpl:268
? UnknownHost
  TestShortCircuitLocalRead.testLongFile:336->doTestShortCircuitRead:238->doTestShortCircuitReadImpl:268
? UnknownHost
  TestShortCircuitLocalRead.testReadWithRemoteBlockReader:583->doTestShortCircuitReadWithRemoteBlockReader:597
? UnknownHost
  TestShortCircuitLocalRead.testFileLocalReadNoChecksum:296->doTestShortCircuitRead:238->doTestShortCircuitReadImpl:268
? UnknownHost
  TestShortCircuitLocalRead.testLocalReadLegacy:314->doTestShortCircuitReadLegacy:232->doTestShortCircuitReadImpl:268
? UnknownHost
  TestShortCircuitLocalRead.testLocalReadFallback:325->doTestShortCircuitReadLegacy:232->doTestShortCircuitReadImpl:268
? UnknownHost
  TestShortCircuitLocalRead.testFileLocalReadChecksum:301->doTestShortCircuitRead:238->doTestShortCircuitReadImpl:268
? UnknownHost
  TestShortCircuitLocalRead.testHandleTruncatedBlockFile:447 ? UnknownHost asf90...
  TestShortCircuitLocalRead.testDeprecatedGetBlockLocalPathInfoRpc:354 ? UnknownHost
  TestMultiThreadedHflush.testHflushWhileClosing:155 ? UnknownHost asf901.ygridc...
  TestMultiThreadedHflush.testMultipleHflushersRepl1:118->doTestMultipleHflushers:128 ?
UnknownHost
  TestMultiThreadedHflush.testMultipleHflushersRepl3:123->doTestMultipleHflushers:128 ?
UnknownHost
  TestFileLengthOnClusterRestart.testFileLengthWithHSyncAndClusterRestartWithOutDNsRegister:42
? UnknownHost
  TestBlockMissingException.testBlockMissingException:57 ? UnknownHost asf901.yg...
  TestReplication.testReplication:248->runReplication:198 ? UnknownHost asf901.y...
  TestReplication.testPendingReplicationRetry:317 ? UnknownHost asf901.ygridcore...
  TestReplication.testReplicationWhenBlockCorruption:474 ? UnknownHost asf901.yg...
  TestReplication.testBadBlockReportOnTransfer:150 ? UnknownHost asf901.ygridcor...
  TestReplication.testReplicationSimulatedStorag:242->runReplication:198 ? UnknownHost
  TestReplication.testReplicateLenMismatchedBlock:405 ? UnknownHost asf901.ygrid...
  TestFileAppend.testSimpleFlush:192 ? UnknownHost asf901.ygridcore.net: asf901....
  TestFileAppend.testFailedAppendBlockRejection:395 ? UnknownHost asf901.ygridco...
  TestFileAppend.testAppendAfterSoftLimit:356 ? UnknownHost asf901.ygridcore.net...
  TestFileAppend.testComplexFlush:248 ? UnknownHost asf901.ygridcore.net: asf901...
  TestFileAppend.testFileNotFound ?  Unexpected exception, expected<java.io.File...
  TestFileAppend.testCopyOnWrite:119 ? UnknownHost asf901.ygridcore.net: asf901....
  TestFileAppend.testAppendTwice:311 ? UnknownHost asf901.ygridcore.net: asf901....
  TestDistributedFileSystem.testDFSSeekExceptions:211 ? UnknownHost asf901.ygrid...
  TestDistributedFileSystem.testGetFileBlockStorageLocationsBatching:674 ? UnknownHost
  TestDistributedFileSystem.testDFSClose:155 ? UnknownHost asf901.ygridcore.net:...
  TestDistributedFileSystem.testStatistics:402 ? UnknownHost asf901.ygridcore.ne...
  TestDistributedFileSystem.testListFiles:947 ? UnknownHost asf901.ygridcore.net...
  TestDistributedFileSystem.testAllWithDualPort:634->testDFSClose:155 ? UnknownHost
  TestDistributedFileSystem.testGetFileBlockStorageLocationsError:760 ? UnknownHost
  TestDistributedFileSystem.testDFSClient:252 ? UnknownHost asf901.ygridcore.net...
  TestDistributedFileSystem.testFileChecksum:504 ? UnknownHost asf901.ygridcore....
  TestDistributedFileSystem.testEmptyDelegationToken:121 NullPointer
  TestDistributedFileSystem.testAllWithNoXmlDefaults:650->testDFSClose:155 ? UnknownHost
  TestDistributedFileSystem.testCreateWithCustomChecksum:885 ? UnknownHost asf90...
  TestDistributedFileSystem.testFileCloseStatus:925 ? UnknownHost asf901.ygridco...
  TestClientBlockVerification.setupCluster:49 ? UnknownHost asf901.ygridcore.net...
  TestClientBlockVerification.teardownCluster:122 NullPointer
  TestMissingBlocksAlert.testMissingBlocksAlert:66 ? UnknownHost asf901.ygridcor...
  TestClose.testWriteAfterClose:37 ? UnknownHost asf901.ygridcore.net: asf901.yg...
  TestFileConcurrentReader.setUp:83->init:96 ? UnknownHost asf901.ygridcore.net:...
  TestFileConcurrentReader.tearDown:88 NullPointer
  TestFileConcurrentReader.setUp:83->init:96 ? UnknownHost asf901.ygridcore.net:...
  TestFileConcurrentReader.tearDown:88 NullPointer
  TestFileConcurrentReader.setUp:83->init:96 ? UnknownHost asf901.ygridcore.net:...
  TestFileConcurrentReader.tearDown:88 NullPointer
  TestFileConcurrentReader.setUp:83->init:96 ? UnknownHost asf901.ygridcore.net:...
  TestFileConcurrentReader.tearDown:88 NullPointer
  TestFileConcurrentReader.setUp:83->init:96 ? UnknownHost asf901.ygridcore.net:...
  TestFileConcurrentReader.tearDown:88 NullPointer
  TestFileConcurrentReader.setUp:83->init:96 ? UnknownHost asf901.ygridcore.net:...
  TestFileConcurrentReader.tearDown:88 NullPointer
  TestFileConcurrentReader.setUp:83->init:96 ? UnknownHost asf901.ygridcore.net:...
  TestFileConcurrentReader.tearDown:88 NullPointer
  TestHDFSServerPorts.testDataNodePorts:311->canStartDataNode:198 ? UnknownHost ...

Tests run: 2145, Failures: 19, Errors: 1225, Skipped: 5

[INFO]                                                                         
[INFO] ------------------------------------------------------------------------
[INFO] Skipping Apache Hadoop HttpFS
[INFO] This project has been banned from the build due to previous failures.
[INFO] ------------------------------------------------------------------------
[INFO]                                                                         
[INFO] ------------------------------------------------------------------------
[INFO] Skipping Apache Hadoop HDFS BookKeeper Journal
[INFO] This project has been banned from the build due to previous failures.
[INFO] ------------------------------------------------------------------------
[INFO]                                                                         
[INFO] ------------------------------------------------------------------------
[INFO] Skipping Apache Hadoop HDFS-NFS
[INFO] This project has been banned from the build due to previous failures.
[INFO] ------------------------------------------------------------------------
[INFO]                                                                         
[INFO] ------------------------------------------------------------------------
[INFO] Building Apache Hadoop HDFS Project 3.0.0-SNAPSHOT
[INFO] ------------------------------------------------------------------------
[WARNING] The POM for org.eclipse.m2e:lifecycle-mapping:jar:1.0.0 is missing, no dependency
information available
[WARNING] Failed to retrieve plugin descriptor for org.eclipse.m2e:lifecycle-mapping:1.0.0:
Plugin org.eclipse.m2e:lifecycle-mapping:1.0.0 or one of its dependencies could not be resolved:
Failure to find org.eclipse.m2e:lifecycle-mapping:jar:1.0.0 in http://repo.maven.apache.org/maven2
was cached in the local repository, resolution will not be reattempted until the update interval
of central has elapsed or updates are forced
[INFO] 
[INFO] --- maven-clean-plugin:2.4.1:clean (default-clean) @ hadoop-hdfs-project ---
[INFO] Deleting <https://builds.apache.org/job/Hadoop-Hdfs-trunk/ws/trunk/hadoop-hdfs-project/target>
[INFO] 
[INFO] --- maven-antrun-plugin:1.7:run (create-testdirs) @ hadoop-hdfs-project ---
[INFO] Executing tasks

main:
    [mkdir] Created dir: <https://builds.apache.org/job/Hadoop-Hdfs-trunk/ws/trunk/hadoop-hdfs-project/target/test-dir>
[INFO] Executed tasks
[INFO] 
[INFO] --- maven-source-plugin:2.1.2:jar-no-fork (hadoop-java-sources) @ hadoop-hdfs-project
---
[INFO] 
[INFO] --- maven-source-plugin:2.1.2:test-jar-no-fork (hadoop-java-sources) @ hadoop-hdfs-project
---
[INFO] 
[INFO] --- maven-enforcer-plugin:1.3.1:enforce (dist-enforce) @ hadoop-hdfs-project ---
[INFO] 
[INFO] --- maven-site-plugin:3.3:attach-descriptor (attach-descriptor) @ hadoop-hdfs-project
---
[INFO] 
[INFO] --- maven-javadoc-plugin:2.8.1:jar (module-javadocs) @ hadoop-hdfs-project ---
[INFO] Not executing Javadoc as the project is not a Java classpath-capable package
[INFO] 
[INFO] --- maven-enforcer-plugin:1.3.1:enforce (depcheck) @ hadoop-hdfs-project ---
[INFO] 
[INFO] --- maven-checkstyle-plugin:2.6:checkstyle (default-cli) @ hadoop-hdfs-project ---
[INFO] 
[INFO] --- findbugs-maven-plugin:2.3.2:findbugs (default-cli) @ hadoop-hdfs-project ---
[INFO] ****** FindBugsMojo execute *******
[INFO] canGenerate is false
[INFO] ------------------------------------------------------------------------
[INFO] Reactor Summary:
[INFO] 
[INFO] Apache Hadoop HDFS ................................ FAILURE [58:01 min]
[INFO] Apache Hadoop HttpFS .............................. SKIPPED
[INFO] Apache Hadoop HDFS BookKeeper Journal ............. SKIPPED
[INFO] Apache Hadoop HDFS-NFS ............................ SKIPPED
[INFO] Apache Hadoop HDFS Project ........................ SUCCESS [  2.218 s]
[INFO] ------------------------------------------------------------------------
[INFO] BUILD FAILURE
[INFO] ------------------------------------------------------------------------
[INFO] Total time: 58:04 min
[INFO] Finished at: 2014-08-06T13:00:44+00:00
[INFO] Final Memory: 62M/911M
[INFO] ------------------------------------------------------------------------
[ERROR] Failed to execute goal org.apache.maven.plugins:maven-surefire-plugin:2.16:test (default-test)
on project hadoop-hdfs: There are test failures.
[ERROR] 
[ERROR] Please refer to <https://builds.apache.org/job/Hadoop-Hdfs-trunk/ws/trunk/hadoop-hdfs-project/hadoop-hdfs/target/surefire-reports>
for the individual test results.
[ERROR] -> [Help 1]
[ERROR] 
[ERROR] To see the full stack trace of the errors, re-run Maven with the -e switch.
[ERROR] Re-run Maven using the -X switch to enable full debug logging.
[ERROR] 
[ERROR] For more information about the errors and possible solutions, please read the following
articles:
[ERROR] [Help 1] http://cwiki.apache.org/confluence/display/MAVEN/MojoFailureException
Build step 'Execute shell' marked build as failure
Archiving artifacts
Recording test results
Updating MAPREDUCE-6014
Updating HADOOP-10791
Updating HADOOP-10905
Updating HADOOP-10939
Updating HADOOP-10759
Updating HDFS-6790
Updating HDFS-6717
Updating YARN-2298
Updating HADOOP-10918
Updating HADOOP-10933

Mime
View raw message