hadoop-hdfs-dev mailing list archives

Site index · List index
Message view « Date » · « Thread »
Top « Date » · « Thread »
From Apache Jenkins Server <jenk...@builds.apache.org>
Subject Build failed in Jenkins: Hadoop-Hdfs-trunk #1828
Date Tue, 05 Aug 2014 12:32:55 GMT
See <https://builds.apache.org/job/Hadoop-Hdfs-trunk/1828/changes>

Changes:

[wang] HADOOP-10936. Change default KeyProvider bitlength to 128. (wang)

[wang] HADOOP-10937. Need to set version name correctly before decrypting EEK. Contributed
by Arun Suresh.

[wang] HADOOP-10927. Fix CredentialShell help behavior and error codes. Contributed by Josh
Elser.

[wang] HADOOP-10928. Incorrect usage on . Contributed by Josh Elser.

[brandonli] commit the additional doc change for HDFS-6717

[eyang] HADOOP-10759. Remove hardcoded JAVA_HEAP_MAX. (Sam Liu via Eric Yang)

[brandonli] HDFS-6451. NFS should not return NFS3ERR_IO for AccessControlException. Contributed
by Abhiraj Butala

[eyang] HADOOP-10759. Remove hardcoded JAVA_HEAP_MAX. (Eric Yang)

[umamahesh] HDFS-6787. Remove duplicate code in FSDirectory#unprotectedConcat. Contributed
by Yi Liu.

[junping_du] YARN-1354. Recover applications upon nodemanager restart. (Contributed by Jason
Lowe)

------------------------------------------
[...truncated 30149 lines...]
  TestHDFSFileSystemContract.setUp:39 ? UnknownHost asf905.ygridcore.net: asf905...
  TestHDFSFileSystemContract.setUp:39 ? UnknownHost asf905.ygridcore.net: asf905...
  TestHDFSFileSystemContract.setUp:39 ? UnknownHost asf905.ygridcore.net: asf905...
  TestHDFSFileSystemContract.setUp:39 ? UnknownHost asf905.ygridcore.net: asf905...
  TestHDFSFileSystemContract.setUp:39 ? UnknownHost asf905.ygridcore.net: asf905...
  TestHDFSFileSystemContract.setUp:39 ? UnknownHost asf905.ygridcore.net: asf905...
  TestHDFSFileSystemContract.setUp:39 ? UnknownHost asf905.ygridcore.net: asf905...
  TestHDFSFileSystemContract.setUp:39 ? UnknownHost asf905.ygridcore.net: asf905...
  TestHDFSFileSystemContract.setUp:39 ? UnknownHost asf905.ygridcore.net: asf905...
  TestHDFSFileSystemContract.setUp:39 ? UnknownHost asf905.ygridcore.net: asf905...
  TestHDFSFileSystemContract.setUp:39 ? UnknownHost asf905.ygridcore.net: asf905...
  TestHDFSFileSystemContract.setUp:39 ? UnknownHost asf905.ygridcore.net: asf905...
  TestHDFSFileSystemContract.setUp:39 ? UnknownHost asf905.ygridcore.net: asf905...
  TestHDFSFileSystemContract.setUp:39 ? UnknownHost asf905.ygridcore.net: asf905...
  TestHDFSFileSystemContract.setUp:39 ? UnknownHost asf905.ygridcore.net: asf905...
  TestHDFSFileSystemContract.setUp:39 ? UnknownHost asf905.ygridcore.net: asf905...
  TestHDFSFileSystemContract.setUp:39 ? UnknownHost asf905.ygridcore.net: asf905...
  TestHDFSFileSystemContract.setUp:39 ? UnknownHost asf905.ygridcore.net: asf905...
  TestHDFSFileSystemContract.setUp:39 ? UnknownHost asf905.ygridcore.net: asf905...
  TestRollingUpgradeDowngrade.testDowngrade:47 ? UnknownHost asf905.ygridcore.ne...
  TestParallelShortCircuitReadUnCached.setupCluster:63->TestParallelReadUtil.setupCluster:71
? UnknownHost
  TestParallelShortCircuitReadUnCached.teardownCluster:75->TestParallelReadUtil.teardownCluster:394
? NullPointer
  TestClientProtocolForPipelineRecovery.testGetNewStamp:47 ? UnknownHost asf905....
  TestClientProtocolForPipelineRecovery.testPipelineRecoveryForLastBlock:138 ? UnknownHost
  TestClientProtocolForPipelineRecovery.testPipelineRecoveryOnRestartFailure:216 ? UnknownHost
  TestClientProtocolForPipelineRecovery.testPipelineRecoveryOnOOB:178 ? UnknownHost
  TestDFSUpgrade.initialize:216 ? UnknownHost asf905.ygridcore.net: asf905.ygrid...
  TestSnapshotCommands.clusterSetUp:56 ? UnknownHost asf905.ygridcore.net: asf90...
  TestDataTransferProtocol.testOpWrite:204 ? UnknownHost asf905.ygridcore.net: a...
  TestDataTransferProtocol.testDataTransferProtocol:339 ? UnknownHost asf905.ygr...
  TestFileCreation.testConcurrentFileCreation:887 ? UnknownHost asf905.ygridcore...
  TestFileCreation.testFsCloseAfterClusterShutdown:1057 ? UnknownHost asf905.ygr...
  TestFileCreation.testFileCreationUsingHostname:189->checkFileCreation:230 ? UnknownHost
  TestFileCreation.testFileCreationSimulated:877->testFileCreation:182->checkFileCreation:230
? UnknownHost
  TestFileCreation.testFsClose:1025 ? UnknownHost asf905.ygridcore.net: asf905.y...
  TestFileCreation.testLeaseExpireHardLimit:964 ? UnknownHost asf905.ygridcore.n...
  TestFileCreation.testFileCreationNamenodeRestart:615 ? UnknownHost asf905.ygri...
  TestFileCreation.testFileIdMismatch:1189 ? UnknownHost asf905.ygridcore.net: a...
  TestFileCreation.testFileCreationSyncOnClose:921 ? UnknownHost asf905.ygridcor...
  TestFileCreation.testServerDefaults:162 ? UnknownHost asf905.ygridcore.net: as...
  TestFileCreation.testOverwriteOpenForWrite:377 ? UnknownHost asf905.ygridcore....
  TestFileCreation.testFileCreationNonRecursive:785 ? UnknownHost asf905.ygridco...
  TestFileCreation.testDFSClientDeath:749 ? UnknownHost asf905.ygridcore.net: as...
  TestFileCreation.testDeleteOnExit:314 ? UnknownHost asf905.ygridcore.net: asf9...
  TestFileCreation.testFileCreationError1:440 ? UnknownHost asf905.ygridcore.net...
  TestFileCreation.testFileCreationError2:515 ? UnknownHost asf905.ygridcore.net...
  TestFileCreation.testFileCreationSetLocalInterface:198->checkFileCreation:230 ? UnknownHost
  TestFileCreation.testCreateNonCanonicalPathAndRestartFromUri:1122->doCreateTest:1132
? UnknownHost
  TestFileCreation.testCreateNonCanonicalPathAndRestartFromString:1112->doCreateTest:1132
? UnknownHost
  TestFileCreation.testFileCreation:182->checkFileCreation:230 ? UnknownHost asf...
  TestFileCreation.testCreateNonCanonicalPathAndRestartRpc:1102->doCreateTest:1132 ? UnknownHost
  TestDFSUpgradeFromImage.testUpgradeFromRel1BBWImage:612->upgradeAndVerify:582 ? UnknownHost
  TestDFSUpgradeFromImage.testUpgradeFromRel22Image:290->upgradeAndVerify:582 ? UnknownHost
  TestDecommission.testRecommission:414->testRecommission:614->startCluster:308 ? UnknownHost
  TestDecommission.testClusterStatsFederation:689->testClusterStats:696->startCluster:308
? UnknownHost
  TestDecommission.testIncludeByRegistrationName:916 ? UnknownHost asf905.ygridc...
  TestDecommission.testDecommissionOnStandby:451 ? UnknownHost asf905.ygridcore....
  TestDecommission.testDecommissionWithNamenodeRestart:840->startCluster:308 ? UnknownHost
  TestDecommission.testHostsFile:727->testHostsFile:744 ? UnknownHost asf905.ygr...
  TestDecommission.testDecommission2:368->startCluster:308 ? UnknownHost asf905....
  TestDecommission.testClusterStats:680->testClusterStats:696->startCluster:308 ? UnknownHost
  TestDecommission.testDecommission:354->testDecommission:551->startCluster:308 ? UnknownHost
  TestDecommission.testHostsFileFederation:738->testHostsFile:744 ? UnknownHost ...
  TestDecommission.testDecommissionFederation:422->testDecommission:551->startCluster:308
? UnknownHost
  TestDecommission.testDecommissionWithOpenfile:786->startCluster:308 ? UnknownHost
  TestGetBlocks.testReadSelectNonStaleDatanode:95 ? UnknownHost asf905.ygridcore...
  TestGetBlocks.testGetBlocks:186 ? UnknownHost asf905.ygridcore.net: asf905.ygr...
  TestMultiThreadedHflush.testHflushWhileClosing:155 ? UnknownHost asf905.ygridc...
  TestMultiThreadedHflush.testMultipleHflushersRepl1:118->doTestMultipleHflushers:128 ?
UnknownHost
  TestMultiThreadedHflush.testMultipleHflushersRepl3:123->doTestMultipleHflushers:128 ?
UnknownHost
  TestLease.testLeaseAfterRename:163 ? UnknownHost asf905.ygridcore.net: asf905....
  TestLease.testLeaseAfterRenameAndRecreate:260 ? UnknownHost asf905.ygridcore.n...
  TestLease.testLease:298 ? UnknownHost asf905.ygridcore.net: asf905.ygridcore.n...
  TestLease.testLeaseAbort:74 ? UnknownHost asf905.ygridcore.net: asf905.ygridco...
  TestInjectionForSimulatedStorage.testInjection:130 ? UnknownHost asf905.ygridc...
  TestHFlush.hSyncUpdateLength_00:104 ? UnknownHost asf905.ygridcore.net: asf905...
  TestHFlush.hSyncUpdateLength_01:132->doTheJob:197 ? UnknownHost asf905.ygridco...
  TestHFlush.hSyncUpdateLength_02:152->doTheJob:197 ? UnknownHost asf905.ygridco...
  TestHFlush.hSyncUpdateLength_03:173->doTheJob:197 ? UnknownHost asf905.ygridco...
  TestHFlush.hFlush_01:55->doTheJob:197 ? UnknownHost asf905.ygridcore.net: asf9...
  TestHFlush.hFlush_02:74->doTheJob:197 ? UnknownHost asf905.ygridcore.net: asf9...
  TestHFlush.hFlush_03:93->doTheJob:197 ? UnknownHost asf905.ygridcore.net: asf9...
  TestHFlush.testHFlushInterrupted:329 ? UnknownHost asf905.ygridcore.net: asf90...
  TestHFlush.testPipelineHeartbeat:279 ? UnknownHost asf905.ygridcore.net: asf90...
  TestDistributedFileSystem.testDFSSeekExceptions:211 ? UnknownHost asf905.ygrid...
  TestDistributedFileSystem.testGetFileBlockStorageLocationsBatching:674 ? UnknownHost
  TestDistributedFileSystem.testDFSClose:155 ? UnknownHost asf905.ygridcore.net:...
  TestDistributedFileSystem.testStatistics:402 ? UnknownHost asf905.ygridcore.ne...
  TestDistributedFileSystem.testListFiles:947 ? UnknownHost asf905.ygridcore.net...
  TestDistributedFileSystem.testAllWithDualPort:634->testDFSClose:155 ? UnknownHost
  TestDistributedFileSystem.testGetFileBlockStorageLocationsError:760 ? UnknownHost
  TestDistributedFileSystem.testDFSClient:252 ? UnknownHost asf905.ygridcore.net...
  TestDistributedFileSystem.testFileChecksum:504 ? UnknownHost asf905.ygridcore....
  TestDistributedFileSystem.testEmptyDelegationToken:121 NullPointer
  TestDistributedFileSystem.testAllWithNoXmlDefaults:650->testDFSClose:155 ? UnknownHost
  TestDistributedFileSystem.testCreateWithCustomChecksum:885 ? UnknownHost asf90...
  TestDistributedFileSystem.testFileCloseStatus:925 ? UnknownHost asf905.ygridco...
  TestRollingUpgradeRollback.testRollbackWithHAQJM:210 ? UnknownHost asf905.ygri...
  TestRollingUpgrade.testCheckpoint:476 ? UnknownHost asf905.ygridcore.net: asf9...
  TestRollingUpgrade.testQuery:409 ? UnknownHost asf905.ygridcore.net: asf905.yg...
  TestRollingUpgrade.testDFSAdminDatanodeUpgradeControlCommands:328 ? UnknownHost
  TestRollingUpgrade.testFinalize:361 ? UnknownHost asf905.ygridcore.net: asf905...
  TestRollingUpgrade.testCheckpointWithSNN:541 ? UnknownHost asf905.ygridcore.ne...
  TestDatanodeDeath.testComplex:426->complexTest:297 ? UnknownHost asf905.ygridc...
  TestDatanodeDeath.testSimple0:417->simpleTest:356 ? UnknownHost asf905.ygridco...
  TestDatanodeDeath.testSimple1:420->simpleTest:356 ? UnknownHost asf905.ygridco...
  TestDatanodeDeath.testSimple2:423->simpleTest:356 ? UnknownHost asf905.ygridco...
  TestCrcCorruption.testCorruptionDuringWrt:96 ? UnknownHost asf905.ygridcore.ne...
  TestCrcCorruption.testCrcCorruption:296->thistest:160 ? UnknownHost asf905.ygr...
  TestCrcCorruption.testEntirelyCorruptFileThreeNodes:331->doTestEntirelyCorruptFile:342
? UnknownHost
  TestCrcCorruption.testEntirelyCorruptFileOneNode:318->doTestEntirelyCorruptFile:342 ?
UnknownHost
  TestFsShellPermission.testDelete:245 ? UnknownHost asf905.ygridcore.net: asf90...
  TestSaslDataTransfer.testClientSaslNoServerSasl:104->startCluster:152 ? UnknownHost
  TestSaslDataTransfer.testServerSaslNoClientSasl:116->startCluster:152 ? UnknownHost
  TestSaslDataTransfer.testClientAndServerDoNotHaveCommonQop:93->startCluster:152 ? UnknownHost
  TestSaslDataTransfer.testAuthentication:64->startCluster:152 ? UnknownHost asf...
  TestSaslDataTransfer.testPrivacy:84->startCluster:152 ? UnknownHost asf905.ygr...
  TestSaslDataTransfer.testIntegrity:74->startCluster:152 ? UnknownHost asf905.y...
  TestDFSAddressConfig.testDFSAddressConfig:52 ? UnknownHost asf905.ygridcore.ne...
  TestParallelUnixDomainRead.setupCluster:44->TestParallelReadUtil.setupCluster:71 ? UnknownHost
  TestParallelUnixDomainRead.teardownCluster:56->TestParallelReadUtil.teardownCluster:394
? NullPointer
  TestReplication.testReplication:248->runReplication:198 ? UnknownHost asf905.y...
  TestReplication.testPendingReplicationRetry:317 ? UnknownHost asf905.ygridcore...
  TestReplication.testReplicationWhenBlockCorruption:474 ? UnknownHost asf905.yg...
  TestReplication.testBadBlockReportOnTransfer:150 ? UnknownHost asf905.ygridcor...
  TestReplication.testReplicationSimulatedStorag:242->runReplication:198 ? UnknownHost
  TestReplication.testReplicateLenMismatchedBlock:405 ? UnknownHost asf905.ygrid...
  TestRead.testEOFWithBlockReaderLocal:61 ? UnknownHost asf905.ygridcore.net: as...
  TestRead.testEOFWithRemoteBlockReader:76 ? UnknownHost asf905.ygridcore.net: a...
  TestPipelines.startUpCluster:65 ? UnknownHost asf905.ygridcore.net: asf905.ygr...
  TestParallelShortCircuitReadNoChecksum.setupCluster:45->TestParallelReadUtil.setupCluster:71
? UnknownHost
  TestParallelShortCircuitReadNoChecksum.teardownCluster:57->TestParallelReadUtil.teardownCluster:394
? NullPointer
  TestParallelShortCircuitRead.setupCluster:45->TestParallelReadUtil.setupCluster:71 ?
UnknownHost
  TestParallelShortCircuitRead.teardownCluster:57->TestParallelReadUtil.teardownCluster:394
? NullPointer
  TestHDFSTrash.setUp:40 ? UnknownHost asf905.ygridcore.net: asf905.ygridcore.ne...
  TestFileAppend.testSimpleFlush:192 ? UnknownHost asf905.ygridcore.net: asf905....
  TestFileAppend.testFailedAppendBlockRejection:395 ? UnknownHost asf905.ygridco...
  TestFileAppend.testAppendAfterSoftLimit:356 ? UnknownHost asf905.ygridcore.net...
  TestFileAppend.testComplexFlush:248 ? UnknownHost asf905.ygridcore.net: asf905...
  TestFileAppend.testFileNotFound ?  Unexpected exception, expected<java.io.File...
  TestFileAppend.testCopyOnWrite:119 ? UnknownHost asf905.ygridcore.net: asf905....
  TestFileAppend.testAppendTwice:311 ? UnknownHost asf905.ygridcore.net: asf905....
  TestDFSRemove.testRemove:60 ? UnknownHost asf905.ygridcore.net: asf905.ygridco...
  TestDFSRollback.testRollback:141 ? UnknownHost asf905.ygridcore.net: asf905.yg...
  TestReadWhileWriting.pipeline_02_03:62 ? UnknownHost asf905.ygridcore.net: asf...
  TestConnCache.testReadFromOneDN:95 ? UnknownHost asf905.ygridcore.net: asf905....
  TestPersistBlocks.testEarlierVersionEditLog:339 ? UnknownHost asf905.ygridcore...
  TestPersistBlocks.testRestartDfsWithAbandonedBlock:165 ? UnknownHost asf905.yg...
  TestPersistBlocks.testRestartWithAppend:275 ? UnknownHost asf905.ygridcore.net...
  TestPersistBlocks.testRestartWithPartialBlockHflushed:226 ? UnknownHost asf905...
  TestPersistBlocks.TestRestartDfsWithFlush:82->testRestartDfs:106 ? UnknownHost
  TestSetrepDecreasing.testSetrepDecreasing:27 ? UnknownHost asf905.ygridcore.ne...
  TestDatanodeLayoutUpgrade.testUpgradeToIdBasedLayout:45 ? UnknownHost asf905.y...
  TestFileCorruption.testArrayOutOfBoundsException:130 ? UnknownHost asf905.ygri...
  TestFileCorruption.testFileCorruption:72 ? UnknownHost asf905.ygridcore.net: a...
  TestDFSStartupVersions.testVersions:242 ? UnknownHost asf905.ygridcore.net: as...
  TestWriteConfigurationToDFS.testWriteConf:39 ? UnknownHost asf905.ygridcore.ne...
  TestListFilesInDFS.testSetUp:42 ? UnknownHost asf905.ygridcore.net: asf905.ygr...
  TestListFilesInDFS.testShutdown:49 NullPointer

Tests run: 2144, Failures: 19, Errors: 1225, Skipped: 5

[INFO]                                                                         
[INFO] ------------------------------------------------------------------------
[INFO] Skipping Apache Hadoop HttpFS
[INFO] This project has been banned from the build due to previous failures.
[INFO] ------------------------------------------------------------------------
[INFO]                                                                         
[INFO] ------------------------------------------------------------------------
[INFO] Skipping Apache Hadoop HDFS BookKeeper Journal
[INFO] This project has been banned from the build due to previous failures.
[INFO] ------------------------------------------------------------------------
[INFO]                                                                         
[INFO] ------------------------------------------------------------------------
[INFO] Skipping Apache Hadoop HDFS-NFS
[INFO] This project has been banned from the build due to previous failures.
[INFO] ------------------------------------------------------------------------
[INFO]                                                                         
[INFO] ------------------------------------------------------------------------
[INFO] Building Apache Hadoop HDFS Project 3.0.0-SNAPSHOT
[INFO] ------------------------------------------------------------------------
[WARNING] The POM for org.eclipse.m2e:lifecycle-mapping:jar:1.0.0 is missing, no dependency
information available
[WARNING] Failed to retrieve plugin descriptor for org.eclipse.m2e:lifecycle-mapping:1.0.0:
Plugin org.eclipse.m2e:lifecycle-mapping:1.0.0 or one of its dependencies could not be resolved:
Failure to find org.eclipse.m2e:lifecycle-mapping:jar:1.0.0 in http://repo.maven.apache.org/maven2
was cached in the local repository, resolution will not be reattempted until the update interval
of central has elapsed or updates are forced
[INFO] 
[INFO] --- maven-clean-plugin:2.4.1:clean (default-clean) @ hadoop-hdfs-project ---
[INFO] Deleting <https://builds.apache.org/job/Hadoop-Hdfs-trunk/ws/trunk/hadoop-hdfs-project/target>
[INFO] 
[INFO] --- maven-antrun-plugin:1.7:run (create-testdirs) @ hadoop-hdfs-project ---
[INFO] Executing tasks

main:
    [mkdir] Created dir: <https://builds.apache.org/job/Hadoop-Hdfs-trunk/ws/trunk/hadoop-hdfs-project/target/test-dir>
[INFO] Executed tasks
[INFO] 
[INFO] --- maven-source-plugin:2.1.2:jar-no-fork (hadoop-java-sources) @ hadoop-hdfs-project
---
[INFO] 
[INFO] --- maven-source-plugin:2.1.2:test-jar-no-fork (hadoop-java-sources) @ hadoop-hdfs-project
---
[INFO] 
[INFO] --- maven-enforcer-plugin:1.3.1:enforce (dist-enforce) @ hadoop-hdfs-project ---
[INFO] 
[INFO] --- maven-site-plugin:3.3:attach-descriptor (attach-descriptor) @ hadoop-hdfs-project
---
[INFO] 
[INFO] --- maven-javadoc-plugin:2.8.1:jar (module-javadocs) @ hadoop-hdfs-project ---
[INFO] Not executing Javadoc as the project is not a Java classpath-capable package
[INFO] 
[INFO] --- maven-enforcer-plugin:1.3.1:enforce (depcheck) @ hadoop-hdfs-project ---
[INFO] 
[INFO] --- maven-checkstyle-plugin:2.6:checkstyle (default-cli) @ hadoop-hdfs-project ---
[INFO] 
[INFO] --- findbugs-maven-plugin:2.3.2:findbugs (default-cli) @ hadoop-hdfs-project ---
[INFO] ****** FindBugsMojo execute *******
[INFO] canGenerate is false
[INFO] ------------------------------------------------------------------------
[INFO] Reactor Summary:
[INFO] 
[INFO] Apache Hadoop HDFS ................................ FAILURE [55:19 min]
[INFO] Apache Hadoop HttpFS .............................. SKIPPED
[INFO] Apache Hadoop HDFS BookKeeper Journal ............. SKIPPED
[INFO] Apache Hadoop HDFS-NFS ............................ SKIPPED
[INFO] Apache Hadoop HDFS Project ........................ SUCCESS [  2.455 s]
[INFO] ------------------------------------------------------------------------
[INFO] BUILD FAILURE
[INFO] ------------------------------------------------------------------------
[INFO] Total time: 55:23 min
[INFO] Finished at: 2014-08-05T12:30:10+00:00
[INFO] Final Memory: 65M/957M
[INFO] ------------------------------------------------------------------------
[ERROR] Failed to execute goal org.apache.maven.plugins:maven-surefire-plugin:2.16:test (default-test)
on project hadoop-hdfs: There are test failures.
[ERROR] 
[ERROR] Please refer to <https://builds.apache.org/job/Hadoop-Hdfs-trunk/ws/trunk/hadoop-hdfs-project/hadoop-hdfs/target/surefire-reports>
for the individual test results.
[ERROR] -> [Help 1]
[ERROR] 
[ERROR] To see the full stack trace of the errors, re-run Maven with the -e switch.
[ERROR] Re-run Maven using the -X switch to enable full debug logging.
[ERROR] 
[ERROR] For more information about the errors and possible solutions, please read the following
articles:
[ERROR] [Help 1] http://cwiki.apache.org/confluence/display/MAVEN/MojoFailureException
Build step 'Execute shell' marked build as failure
Archiving artifacts
Recording test results
Updating YARN-1354
Updating HADOOP-10759
Updating HDFS-6717
Updating HADOOP-10928
Updating HADOOP-10927
Updating HADOOP-10936
Updating HDFS-6451
Updating HADOOP-10937
Updating HDFS-6787

Mime
View raw message