hadoop-hdfs-dev mailing list archives

Site index · List index
Message view « Date » · « Thread »
Top « Date » · « Thread »
From Apache Jenkins Server <jenk...@builds.apache.org>
Subject Build failed in Jenkins: Hadoop-Hdfs-trunk #1753
Date Wed, 14 May 2014 22:48:33 GMT
See <https://builds.apache.org/job/Hadoop-Hdfs-trunk/1753/changes>

Changes:

[cdouglas] MAPREDUCE-5821. Avoid unintentional reallocation of byte arrays in segments
during merge. Contributed by Todd Lipcon

[sandy] YARN-2042. String shouldn't be compared using == in QueuePlacementRule#NestedUserQueue#getQueueForApp
(Chen He via Sandy Ryza)

[sandy] YARN-1986. In Fifo Scheduler, node heartbeat in between creating app and attempt causes
NPE (Hong Zhiguo via Sandy Ryza)

[jing9] HDFS-6381. Fix a typo in INodeReference.java. Contributed by Binglin Chang.

[kihwal] HDFS-6293. Issues with OIV processing PB-based fsimages. Contributed by Kihwal Lee.

[junping_du] YARN-1362. Distinguish between nodemanager shutdown for decommission vs shutdown
for restart. (Contributed by Jason Lowe)

[cdouglas] YARN-1957. Consider the max capacity of the queue when computing the ideal
capacity for preemption. Contributed by Carlo Curino

[cnauroth] HDFS-6370. Web UI fails to display in intranet under IE. Contributed by Haohui
Mai.

[jeagles] YARN-1981. Nodemanager version is not updated when a node reconnects (Jason Lowe
via jeagles)

[vinodkv] YARN-1861. Fixed a bug in RM to reset leader-election on fencing that was causing
both RMs to be stuck in standby mode when automatic failover is enabled. Contributed by Karthik
Kambatla and Xuan Gong.

[cmccabe] HDFS-6355. Fix divide-by-zero, improper use of wall-clock time in BlockPoolSliceScanner
(cmccabe)

[kasha] MAPREDUCE-5652. NM Recovery. ShuffleHandler should handle NM restarts. (Jason Lowe
via kasha)

[jlowe] MAPREDUCE-5814. fat jar with *-default.xml may fail when mapreduce.job.classloader=true.
Contributed by Gera Shegalov

[tucu] HADOOP-10583. bin/hadoop key throws NPE with no args and assorted other fixups. (clamb
via tucu)

[jeagles] MAPREDUCE-5888. Failed job leaves hung AM after it unregisters (Jason Lowe via jeagles)

[jing9] HDFS-6186. Pause deletion of blocks when the namenode starts up. Contributed by Jing
Zhao.

[brandonli] HADOOP-10572. Example NFS mount command must pass noacl as it isn't supported
by the server yet. Contributed by Harsh J.

[suresh] HADOOP-10566. Adding files missed in previous commit 1594280

[suresh] HADOOP-10566. Refactor proxyservers out of ProxyUsers. Contributed by Benoy Antony.

[jlowe] YARN-1751. Improve MiniYarnCluster for log aggregation testing. Contributed by Ming
Ma

[jeagles] HDFS-6305. WebHdfs response decoding may throw RuntimeExceptions (Daryn Sharp via
jeagles)

[jeagles] HADOOP-10585. Retry polices ignore interrupted exceptions (Daryn Sharp via jeagles)

[kihwal] HDFS-6334. Client failover proxy provider for IP failover based NN HA. Contributed
by Kihwal Lee.

[umamahesh] HDFS-6367. EnumSetParam$Domain#parse fails for parameter containing more than
one enum. Contributed by Yi Liu.

[jianhe] YARN-1976. Fix CHANGES.txt for YARN-1976.

[jianhe] YARN-2016. Fix a bug in GetApplicationsRequestPBImpl to add the missed fields to
proto. Contributed by Junping Du

[kihwal] HDFS-5522. Datanode disk error check may be incorrectly skipped. Contributed by Rushabh
Shah.

[wheat9] HDFS-6230. Expose upgrade status through NameNode web UI. Contributed by Mit Desai.

[wang] Command hdfs dfs -rm -r can't remove empty directory. Contributed by Yongjun Zhang.

[kasha] MAPREDUCE-5774. Job overview in History UI should list reducer phases in chronological
order. (Gera Shegalov via kasha)

[jianhe] YARN-1975. Fix yarn application CLI to print the scheme of the tracking url of failed/killed
applications. Contributed by Junping Du

[junping_du] YARN-2011. Fix typo and warning in TestLeafQueue (Contributed by Chen He)

[kasha] YARN-1987. Wrapper for leveldb DBIterator to aid in handling database exceptions.
(Jason Lowe via kasha)

[wheat9] HDFS-6328. Clean up dead code in FSDirectory. Contributed by Haohui Mai.

[vinodkv] YARN-1962. Changed Timeline Service client configuration to be off by default given
the non-readiness of the feature yet. Contributed by Mohammad Kamrul Islam.

[vinodkv] YARN-1982. Renamed the daemon name to be TimelineServer instead of History Server
and deprecated the old usage. Contributed by Zhijie Shen.

------------------------------------------
[...truncated 12743 lines...]
Running org.apache.hadoop.hdfs.server.namenode.ha.TestFailureOfSharedDir
Tests run: 4, Failures: 0, Errors: 0, Skipped: 0, Time elapsed: 8.506 sec - in org.apache.hadoop.hdfs.server.namenode.ha.TestFailureOfSharedDir
Running org.apache.hadoop.hdfs.server.namenode.ha.TestStandbyIsHot
Tests run: 2, Failures: 0, Errors: 0, Skipped: 0, Time elapsed: 18.027 sec - in org.apache.hadoop.hdfs.server.namenode.ha.TestStandbyIsHot
Running org.apache.hadoop.hdfs.server.namenode.ha.TestDFSUpgradeWithHA
Tests run: 9, Failures: 0, Errors: 0, Skipped: 0, Time elapsed: 28.265 sec - in org.apache.hadoop.hdfs.server.namenode.ha.TestDFSUpgradeWithHA
Running org.apache.hadoop.hdfs.server.namenode.ha.TestHAStateTransitions
Tests run: 11, Failures: 0, Errors: 0, Skipped: 0, Time elapsed: 74.131 sec - in org.apache.hadoop.hdfs.server.namenode.ha.TestHAStateTransitions
Running org.apache.hadoop.hdfs.server.namenode.ha.TestStateTransitionFailure
Tests run: 1, Failures: 0, Errors: 0, Skipped: 0, Time elapsed: 4.019 sec - in org.apache.hadoop.hdfs.server.namenode.ha.TestStateTransitionFailure
Running org.apache.hadoop.hdfs.server.namenode.ha.TestPendingCorruptDnMessages
Tests run: 1, Failures: 0, Errors: 0, Skipped: 0, Time elapsed: 13.452 sec - in org.apache.hadoop.hdfs.server.namenode.ha.TestPendingCorruptDnMessages
Running org.apache.hadoop.hdfs.server.namenode.ha.TestRetryCacheWithHA
Tests run: 20, Failures: 0, Errors: 0, Skipped: 0, Time elapsed: 91.758 sec - in org.apache.hadoop.hdfs.server.namenode.ha.TestRetryCacheWithHA
Running org.apache.hadoop.hdfs.server.namenode.ha.TestStandbyCheckpoints
Tests run: 7, Failures: 0, Errors: 0, Skipped: 0, Time elapsed: 82.594 sec - in org.apache.hadoop.hdfs.server.namenode.ha.TestStandbyCheckpoints
Running org.apache.hadoop.hdfs.server.namenode.ha.TestDNFencingWithReplication
Tests run: 1, Failures: 0, Errors: 0, Skipped: 0, Time elapsed: 56.055 sec - in org.apache.hadoop.hdfs.server.namenode.ha.TestDNFencingWithReplication
Running org.apache.hadoop.hdfs.server.namenode.ha.TestBootstrapStandby
Tests run: 5, Failures: 0, Errors: 0, Skipped: 0, Time elapsed: 10.454 sec - in org.apache.hadoop.hdfs.server.namenode.ha.TestBootstrapStandby
Running org.apache.hadoop.hdfs.server.namenode.ha.TestDelegationTokensWithHA
Tests run: 6, Failures: 0, Errors: 0, Skipped: 0, Time elapsed: 10.908 sec - in org.apache.hadoop.hdfs.server.namenode.ha.TestDelegationTokensWithHA
Running org.apache.hadoop.hdfs.server.namenode.ha.TestPipelinesFailover
Tests run: 8, Failures: 0, Errors: 0, Skipped: 0, Time elapsed: 104.545 sec - in org.apache.hadoop.hdfs.server.namenode.ha.TestPipelinesFailover
Running org.apache.hadoop.hdfs.server.namenode.ha.TestDFSZKFailoverController
Tests run: 3, Failures: 0, Errors: 0, Skipped: 0, Time elapsed: 16.55 sec - in org.apache.hadoop.hdfs.server.namenode.ha.TestDFSZKFailoverController
Running org.apache.hadoop.hdfs.server.namenode.ha.TestFailoverWithBlockTokensEnabled
Tests run: 4, Failures: 0, Errors: 0, Skipped: 0, Time elapsed: 35.638 sec - in org.apache.hadoop.hdfs.server.namenode.ha.TestFailoverWithBlockTokensEnabled
Running org.apache.hadoop.hdfs.server.namenode.ha.TestEditLogTailer
Tests run: 3, Failures: 0, Errors: 0, Skipped: 0, Time elapsed: 9.36 sec - in org.apache.hadoop.hdfs.server.namenode.ha.TestEditLogTailer
Running org.apache.hadoop.hdfs.server.namenode.ha.TestNNHealthCheck
Tests run: 1, Failures: 0, Errors: 0, Skipped: 0, Time elapsed: 3.808 sec - in org.apache.hadoop.hdfs.server.namenode.ha.TestNNHealthCheck
Running org.apache.hadoop.hdfs.server.namenode.ha.TestBootstrapStandbyWithQJM
Tests run: 2, Failures: 0, Errors: 0, Skipped: 0, Time elapsed: 8.983 sec - in org.apache.hadoop.hdfs.server.namenode.ha.TestBootstrapStandbyWithQJM
Running org.apache.hadoop.hdfs.server.namenode.ha.TestHarFileSystemWithHA
Tests run: 1, Failures: 0, Errors: 0, Skipped: 0, Time elapsed: 4.346 sec - in org.apache.hadoop.hdfs.server.namenode.ha.TestHarFileSystemWithHA
Running org.apache.hadoop.hdfs.server.namenode.ha.TestHAAppend
Tests run: 1, Failures: 0, Errors: 0, Skipped: 0, Time elapsed: 6.476 sec - in org.apache.hadoop.hdfs.server.namenode.ha.TestHAAppend
Running org.apache.hadoop.hdfs.server.namenode.ha.TestHAConfiguration
Tests run: 4, Failures: 0, Errors: 0, Skipped: 0, Time elapsed: 1.18 sec - in org.apache.hadoop.hdfs.server.namenode.ha.TestHAConfiguration
Running org.apache.hadoop.hdfs.server.namenode.ha.TestQuotasWithHA
Tests run: 1, Failures: 0, Errors: 0, Skipped: 0, Time elapsed: 7.191 sec - in org.apache.hadoop.hdfs.server.namenode.ha.TestQuotasWithHA
Running org.apache.hadoop.hdfs.server.namenode.ha.TestHASafeMode
Tests run: 18, Failures: 0, Errors: 0, Skipped: 0, Time elapsed: 97.777 sec - in org.apache.hadoop.hdfs.server.namenode.ha.TestHASafeMode
Running org.apache.hadoop.hdfs.server.namenode.ha.TestLossyRetryInvocationHandler
Tests run: 1, Failures: 0, Errors: 0, Skipped: 0, Time elapsed: 4.339 sec - in org.apache.hadoop.hdfs.server.namenode.ha.TestLossyRetryInvocationHandler
Running org.apache.hadoop.hdfs.server.namenode.ha.TestEditLogsDuringFailover
Tests run: 3, Failures: 0, Errors: 0, Skipped: 0, Time elapsed: 7.251 sec - in org.apache.hadoop.hdfs.server.namenode.ha.TestEditLogsDuringFailover
Running org.apache.hadoop.hdfs.server.namenode.ha.TestDNFencing
Tests run: 6, Failures: 0, Errors: 0, Skipped: 0, Time elapsed: 45.823 sec - in org.apache.hadoop.hdfs.server.namenode.ha.TestDNFencing
Running org.apache.hadoop.hdfs.server.namenode.ha.TestGetGroupsWithHA
Tests run: 6, Failures: 0, Errors: 0, Skipped: 0, Time elapsed: 7.378 sec - in org.apache.hadoop.hdfs.server.namenode.ha.TestGetGroupsWithHA
Running org.apache.hadoop.hdfs.server.namenode.ha.TestHAMetrics
Tests run: 1, Failures: 0, Errors: 0, Skipped: 0, Time elapsed: 7.98 sec - in org.apache.hadoop.hdfs.server.namenode.ha.TestHAMetrics
Running org.apache.hadoop.hdfs.server.namenode.ha.TestHAFsck
Tests run: 1, Failures: 0, Errors: 0, Skipped: 0, Time elapsed: 4.669 sec - in org.apache.hadoop.hdfs.server.namenode.ha.TestHAFsck
Running org.apache.hadoop.hdfs.server.namenode.ha.TestFailureToReadEdits
Tests run: 6, Failures: 0, Errors: 0, Skipped: 0, Time elapsed: 86.716 sec - in org.apache.hadoop.hdfs.server.namenode.ha.TestFailureToReadEdits
Running org.apache.hadoop.hdfs.server.namenode.ha.TestInitializeSharedEdits
Tests run: 4, Failures: 0, Errors: 0, Skipped: 0, Time elapsed: 12.845 sec - in org.apache.hadoop.hdfs.server.namenode.ha.TestInitializeSharedEdits
Running org.apache.hadoop.hdfs.qjournal.client.TestIPCLoggerChannel
Tests run: 3, Failures: 0, Errors: 0, Skipped: 0, Time elapsed: 1.001 sec - in org.apache.hadoop.hdfs.qjournal.client.TestIPCLoggerChannel
Running org.apache.hadoop.hdfs.qjournal.client.TestQuorumJournalManagerUnit
Tests run: 6, Failures: 0, Errors: 0, Skipped: 0, Time elapsed: 1.283 sec - in org.apache.hadoop.hdfs.qjournal.client.TestQuorumJournalManagerUnit
Running org.apache.hadoop.hdfs.qjournal.client.TestQJMWithFaults
Tests run: 2, Failures: 0, Errors: 0, Skipped: 0, Time elapsed: 188.853 sec - in org.apache.hadoop.hdfs.qjournal.client.TestQJMWithFaults
Running org.apache.hadoop.hdfs.qjournal.client.TestSegmentRecoveryComparator
Tests run: 1, Failures: 0, Errors: 0, Skipped: 0, Time elapsed: 0.277 sec - in org.apache.hadoop.hdfs.qjournal.client.TestSegmentRecoveryComparator
Running org.apache.hadoop.hdfs.qjournal.client.TestEpochsAreUnique
Tests run: 1, Failures: 0, Errors: 0, Skipped: 0, Time elapsed: 6.89 sec - in org.apache.hadoop.hdfs.qjournal.client.TestEpochsAreUnique
Running org.apache.hadoop.hdfs.qjournal.client.TestQuorumCall
Tests run: 1, Failures: 0, Errors: 0, Skipped: 0, Time elapsed: 0.232 sec - in org.apache.hadoop.hdfs.qjournal.client.TestQuorumCall
Running org.apache.hadoop.hdfs.qjournal.client.TestQuorumJournalManager
Tests run: 21, Failures: 0, Errors: 0, Skipped: 0, Time elapsed: 27.195 sec - in org.apache.hadoop.hdfs.qjournal.client.TestQuorumJournalManager
Running org.apache.hadoop.hdfs.qjournal.TestMiniJournalCluster
Tests run: 1, Failures: 0, Errors: 0, Skipped: 0, Time elapsed: 1.258 sec - in org.apache.hadoop.hdfs.qjournal.TestMiniJournalCluster
Running org.apache.hadoop.hdfs.qjournal.server.TestJournal
Tests run: 12, Failures: 0, Errors: 0, Skipped: 0, Time elapsed: 2.231 sec - in org.apache.hadoop.hdfs.qjournal.server.TestJournal
Running org.apache.hadoop.hdfs.qjournal.server.TestJournalNode
Tests run: 6, Failures: 0, Errors: 0, Skipped: 0, Time elapsed: 6.284 sec - in org.apache.hadoop.hdfs.qjournal.server.TestJournalNode
Running org.apache.hadoop.hdfs.qjournal.server.TestJournalNodeMXBean
Tests run: 1, Failures: 0, Errors: 0, Skipped: 0, Time elapsed: 1.454 sec - in org.apache.hadoop.hdfs.qjournal.server.TestJournalNodeMXBean
Running org.apache.hadoop.hdfs.qjournal.TestNNWithQJM
Tests run: 3, Failures: 0, Errors: 0, Skipped: 0, Time elapsed: 8.22 sec - in org.apache.hadoop.hdfs.qjournal.TestNNWithQJM
Running org.apache.hadoop.hdfs.TestSetTimes
Tests run: 3, Failures: 0, Errors: 0, Skipped: 0, Time elapsed: 10.421 sec - in org.apache.hadoop.hdfs.TestSetTimes
Running org.apache.hadoop.hdfs.TestDFSStorageStateRecovery
Tests run: 3, Failures: 0, Errors: 0, Skipped: 0, Time elapsed: 99.79 sec - in org.apache.hadoop.hdfs.TestDFSStorageStateRecovery
Running org.apache.hadoop.hdfs.TestIsMethodSupported
Tests run: 10, Failures: 0, Errors: 0, Skipped: 0, Time elapsed: 4.166 sec - in org.apache.hadoop.hdfs.TestIsMethodSupported
Running org.apache.hadoop.hdfs.TestClientProtocolForPipelineRecovery
Tests run: 4, Failures: 0, Errors: 0, Skipped: 0, Time elapsed: 39.349 sec - in org.apache.hadoop.hdfs.TestClientProtocolForPipelineRecovery
Running org.apache.hadoop.hdfs.TestDFSRollback
Tests run: 1, Failures: 0, Errors: 0, Skipped: 0, Time elapsed: 18.605 sec - in org.apache.hadoop.hdfs.TestDFSRollback
Running org.apache.hadoop.hdfs.TestPread
Tests run: 6, Failures: 0, Errors: 0, Skipped: 0, Time elapsed: 99.804 sec - in org.apache.hadoop.hdfs.TestPread
Running org.apache.hadoop.hdfs.TestModTime
Tests run: 2, Failures: 0, Errors: 0, Skipped: 0, Time elapsed: 15.624 sec - in org.apache.hadoop.hdfs.TestModTime
Running org.apache.hadoop.hdfs.TestDFSShellGenericOptions
Tests run: 1, Failures: 0, Errors: 0, Skipped: 0, Time elapsed: 4.048 sec - in org.apache.hadoop.hdfs.TestDFSShellGenericOptions
Running org.apache.hadoop.hdfs.TestSmallBlock
Tests run: 2, Failures: 0, Errors: 0, Skipped: 0, Time elapsed: 5.235 sec - in org.apache.hadoop.hdfs.TestSmallBlock
Running org.apache.hadoop.hdfs.TestFileCreationClient
Tests run: 1, Failures: 0, Errors: 0, Skipped: 0, Time elapsed: 20.676 sec - in org.apache.hadoop.hdfs.TestFileCreationClient
Running org.apache.hadoop.net.TestNetworkTopology
Tests run: 10, Failures: 0, Errors: 0, Skipped: 0, Time elapsed: 8.72 sec - in org.apache.hadoop.net.TestNetworkTopology
Running org.apache.hadoop.security.TestPermission
Tests run: 3, Failures: 0, Errors: 0, Skipped: 0, Time elapsed: 5.77 sec - in org.apache.hadoop.security.TestPermission
Running org.apache.hadoop.security.TestRefreshUserMappings
Tests run: 2, Failures: 0, Errors: 0, Skipped: 0, Time elapsed: 5.791 sec - in org.apache.hadoop.security.TestRefreshUserMappings
Running org.apache.hadoop.security.TestPermissionSymlinks
Tests run: 14, Failures: 0, Errors: 0, Skipped: 0, Time elapsed: 5.031 sec - in org.apache.hadoop.security.TestPermissionSymlinks
Running org.apache.hadoop.cli.TestHDFSCLI
Tests run: 1, Failures: 0, Errors: 0, Skipped: 0, Time elapsed: 63.597 sec - in org.apache.hadoop.cli.TestHDFSCLI
Running org.apache.hadoop.cli.TestAclCLI
Tests run: 1, Failures: 0, Errors: 0, Skipped: 0, Time elapsed: 6.16 sec - in org.apache.hadoop.cli.TestAclCLI
Running org.apache.hadoop.cli.TestCacheAdminCLI
Tests run: 1, Failures: 0, Errors: 0, Skipped: 0, Time elapsed: 6.816 sec - in org.apache.hadoop.cli.TestCacheAdminCLI
Running org.apache.hadoop.tools.TestJMXGet
Tests run: 2, Failures: 0, Errors: 0, Skipped: 0, Time elapsed: 5.554 sec - in org.apache.hadoop.tools.TestJMXGet
Running org.apache.hadoop.tools.TestTools
Tests run: 5, Failures: 0, Errors: 0, Skipped: 0, Time elapsed: 1.159 sec - in org.apache.hadoop.tools.TestTools

Results :

Failed tests: 
  TestTransferFsImage.testClientSideException:80 
Wanted but not invoked:
nNStorage.reportErrorOnFile(
    /xxxxx-does-not-exist/blah
);
-> at org.apache.hadoop.hdfs.server.namenode.TestTransferFsImage.testClientSideException(TestTransferFsImage.java:80)
Actually, there were zero interactions with this mock.


Tests run: 2671, Failures: 1, Errors: 0, Skipped: 17

[INFO]                                                                         
[INFO] ------------------------------------------------------------------------
[INFO] Skipping Apache Hadoop HttpFS
[INFO] This project has been banned from the build due to previous failures.
[INFO] ------------------------------------------------------------------------
[INFO]                                                                         
[INFO] ------------------------------------------------------------------------
[INFO] Skipping Apache Hadoop HDFS BookKeeper Journal
[INFO] This project has been banned from the build due to previous failures.
[INFO] ------------------------------------------------------------------------
[INFO]                                                                         
[INFO] ------------------------------------------------------------------------
[INFO] Skipping Apache Hadoop HDFS-NFS
[INFO] This project has been banned from the build due to previous failures.
[INFO] ------------------------------------------------------------------------
[INFO]                                                                         
[INFO] ------------------------------------------------------------------------
[INFO] Building Apache Hadoop HDFS Project 3.0.0-SNAPSHOT
[INFO] ------------------------------------------------------------------------
[WARNING] The POM for org.eclipse.m2e:lifecycle-mapping:jar:1.0.0 is missing, no dependency
information available
[WARNING] Failed to retrieve plugin descriptor for org.eclipse.m2e:lifecycle-mapping:1.0.0:
Plugin org.eclipse.m2e:lifecycle-mapping:1.0.0 or one of its dependencies could not be resolved:
Failed to read artifact descriptor for org.eclipse.m2e:lifecycle-mapping:jar:1.0.0
[INFO] 
[INFO] --- maven-clean-plugin:2.4.1:clean (default-clean) @ hadoop-hdfs-project ---
[INFO] Deleting <https://builds.apache.org/job/Hadoop-Hdfs-trunk/ws/trunk/hadoop-hdfs-project/target>
[INFO] 
[INFO] --- maven-antrun-plugin:1.7:run (create-testdirs) @ hadoop-hdfs-project ---
[INFO] Executing tasks

main:
    [mkdir] Created dir: <https://builds.apache.org/job/Hadoop-Hdfs-trunk/ws/trunk/hadoop-hdfs-project/target/test-dir>
[INFO] Executed tasks
[INFO] 
[INFO] --- maven-source-plugin:2.1.2:jar-no-fork (hadoop-java-sources) @ hadoop-hdfs-project
---
[INFO] 
[INFO] --- maven-source-plugin:2.1.2:test-jar-no-fork (hadoop-java-sources) @ hadoop-hdfs-project
---
[INFO] 
[INFO] --- maven-enforcer-plugin:1.3.1:enforce (dist-enforce) @ hadoop-hdfs-project ---
[INFO] 
[INFO] --- maven-site-plugin:3.3:attach-descriptor (attach-descriptor) @ hadoop-hdfs-project
---
[INFO] 
[INFO] --- maven-javadoc-plugin:2.8.1:jar (module-javadocs) @ hadoop-hdfs-project ---
[INFO] Not executing Javadoc as the project is not a Java classpath-capable package
[INFO] 
[INFO] --- maven-enforcer-plugin:1.3.1:enforce (depcheck) @ hadoop-hdfs-project ---
[INFO] 
[INFO] --- maven-checkstyle-plugin:2.6:checkstyle (default-cli) @ hadoop-hdfs-project ---
[INFO] 
[INFO] --- findbugs-maven-plugin:2.3.2:findbugs (default-cli) @ hadoop-hdfs-project ---
[INFO] ****** FindBugsMojo execute *******
[INFO] canGenerate is false
[INFO] ------------------------------------------------------------------------
[INFO] Reactor Summary:
[INFO] 
[INFO] Apache Hadoop HDFS ................................ FAILURE [2:14:13.638s]
[INFO] Apache Hadoop HttpFS .............................. SKIPPED
[INFO] Apache Hadoop HDFS BookKeeper Journal ............. SKIPPED
[INFO] Apache Hadoop HDFS-NFS ............................ SKIPPED
[INFO] Apache Hadoop HDFS Project ........................ SUCCESS [3.276s]
[INFO] ------------------------------------------------------------------------
[INFO] BUILD FAILURE
[INFO] ------------------------------------------------------------------------
[INFO] Total time: 2:14:18.415s
[INFO] Finished at: Wed May 14 22:47:43 UTC 2014
[INFO] Final Memory: 31M/294M
[INFO] ------------------------------------------------------------------------
[ERROR] Failed to execute goal org.apache.maven.plugins:maven-surefire-plugin:2.16:test (default-test)
on project hadoop-hdfs: There are test failures.
[ERROR] 
[ERROR] Please refer to <https://builds.apache.org/job/Hadoop-Hdfs-trunk/ws/trunk/hadoop-hdfs-project/hadoop-hdfs/target/surefire-reports>
for the individual test results.
[ERROR] -> [Help 1]
[ERROR] 
[ERROR] To see the full stack trace of the errors, re-run Maven with the -e switch.
[ERROR] Re-run Maven using the -X switch to enable full debug logging.
[ERROR] 
[ERROR] For more information about the errors and possible solutions, please read the following
articles:
[ERROR] [Help 1] http://cwiki.apache.org/confluence/display/MAVEN/MojoFailureException
Build step 'Execute shell' marked build as failure
Archiving artifacts
Recording test results
Updating HDFS-6381
Updating HADOOP-10572
Updating YARN-2042
Updating HDFS-6186
Updating MAPREDUCE-5774
Updating MAPREDUCE-5652
Updating YARN-1751
Updating YARN-1975
Updating YARN-1976
Updating YARN-1957
Updating HDFS-6355
Updating HDFS-6334
Updating HDFS-5522
Updating MAPREDUCE-5814
Updating MAPREDUCE-5888
Updating HADOOP-10585
Updating MAPREDUCE-5821
Updating HDFS-6293
Updating HDFS-6370
Updating HADOOP-10583
Updating HADOOP-10566
Updating HDFS-6230
Updating YARN-1362
Updating YARN-2011
Updating YARN-1861
Updating YARN-1982
Updating YARN-1981
Updating YARN-1962
Updating YARN-2016
Updating YARN-1986
Updating YARN-1987
Updating HDFS-6367
Updating HDFS-6328
Updating HDFS-6305

Mime
View raw message