hadoop-hdfs-dev mailing list archives

Site index · List index
Message view « Date » · « Thread »
Top « Date » · « Thread »
From Apache Jenkins Server <jenk...@builds.apache.org>
Subject Build failed in Jenkins: Hadoop-Hdfs-trunk #1758
Date Thu, 29 May 2014 14:02:05 GMT
See <https://builds.apache.org/job/Hadoop-Hdfs-trunk/1758/changes>

Changes:

[devaraj] MAPREDUCE-5895. Close streams properly to avoid leakage in TaskLog. Contributed
by Kousuke Saruta.

[sandy] YARN-596. Use scheduling policies throughout the queue hierarchy to decide which containers
to preempt (Wei Yan via Sandy Ryza)

[wang] HDFS-6453. Use Time#monotonicNow to avoid system clock reset. Contributed by Liang
Xie.

[jlowe] MAPREDUCE-5862. Line records longer than 2x split size aren't handled correctly. Contributed
by bc Wong

[zjshen] YARN-2107. Refactored timeline classes into o.a.h.y.s.timeline package. Contributed
by Vinod Kumar Vavilapalli.

[cmccabe] HDFS-6448. BlockReaderLocalLegacy should set socket timeout based on conf.socketTimeout
(liangxie via cmccabe)

[arp] HDFS-6442. Fix TestEditLogAutoroll and TestStandbyCheckpoints failure caused by port
conficts. (Contributed by Zesheng Wu)

[xgong] HADOOP-10625. Trim configuration names when putting/getting them to properties

------------------------------------------
[...truncated 14955 lines...]
Running org.apache.hadoop.hdfs.server.namenode.TestNameNodeResourceChecker
Tests run: 6, Failures: 0, Errors: 0, Skipped: 0, Time elapsed: 5.538 sec - in org.apache.hadoop.hdfs.server.namenode.TestNameNodeResourceChecker
Running org.apache.hadoop.hdfs.server.namenode.TestNameNodeAcl
Tests run: 61, Failures: 0, Errors: 0, Skipped: 0, Time elapsed: 6.96 sec - in org.apache.hadoop.hdfs.server.namenode.TestNameNodeAcl
Running org.apache.hadoop.hdfs.server.namenode.TestFSPermissionChecker
Tests run: 15, Failures: 0, Errors: 0, Skipped: 0, Time elapsed: 2.292 sec - in org.apache.hadoop.hdfs.server.namenode.TestFSPermissionChecker
Running org.apache.hadoop.hdfs.server.namenode.TestAddBlock
Tests run: 2, Failures: 0, Errors: 0, Skipped: 0, Time elapsed: 22.961 sec - in org.apache.hadoop.hdfs.server.namenode.TestAddBlock
Running org.apache.hadoop.hdfs.server.namenode.TestLeaseManager
Tests run: 1, Failures: 0, Errors: 0, Skipped: 0, Time elapsed: 3.582 sec - in org.apache.hadoop.hdfs.server.namenode.TestLeaseManager
Running org.apache.hadoop.hdfs.server.namenode.TestCheckpoint
Tests run: 38, Failures: 0, Errors: 0, Skipped: 0, Time elapsed: 77.033 sec - in org.apache.hadoop.hdfs.server.namenode.TestCheckpoint
Running org.apache.hadoop.hdfs.server.namenode.TestFSNamesystem
Tests run: 6, Failures: 0, Errors: 0, Skipped: 0, Time elapsed: 3.115 sec - in org.apache.hadoop.hdfs.server.namenode.TestFSNamesystem
Running org.apache.hadoop.hdfs.server.namenode.TestNNStorageRetentionManager
Tests run: 9, Failures: 0, Errors: 0, Skipped: 0, Time elapsed: 1.125 sec - in org.apache.hadoop.hdfs.server.namenode.TestNNStorageRetentionManager
Running org.apache.hadoop.hdfs.server.namenode.TestBlockUnderConstruction
Tests run: 2, Failures: 0, Errors: 0, Skipped: 0, Time elapsed: 4.804 sec - in org.apache.hadoop.hdfs.server.namenode.TestBlockUnderConstruction
Running org.apache.hadoop.hdfs.server.namenode.ha.TestFailureOfSharedDir
Tests run: 4, Failures: 0, Errors: 0, Skipped: 0, Time elapsed: 8.702 sec - in org.apache.hadoop.hdfs.server.namenode.ha.TestFailureOfSharedDir
Running org.apache.hadoop.hdfs.server.namenode.ha.TestStandbyIsHot
Tests run: 2, Failures: 0, Errors: 0, Skipped: 0, Time elapsed: 17.757 sec - in org.apache.hadoop.hdfs.server.namenode.ha.TestStandbyIsHot
Running org.apache.hadoop.hdfs.server.namenode.ha.TestDFSUpgradeWithHA
Tests run: 9, Failures: 0, Errors: 0, Skipped: 0, Time elapsed: 28.434 sec - in org.apache.hadoop.hdfs.server.namenode.ha.TestDFSUpgradeWithHA
Running org.apache.hadoop.hdfs.server.namenode.ha.TestHAStateTransitions
Tests run: 11, Failures: 0, Errors: 0, Skipped: 0, Time elapsed: 82.318 sec - in org.apache.hadoop.hdfs.server.namenode.ha.TestHAStateTransitions
Running org.apache.hadoop.hdfs.server.namenode.ha.TestXAttrsWithHA
Tests run: 1, Failures: 0, Errors: 0, Skipped: 0, Time elapsed: 5.81 sec - in org.apache.hadoop.hdfs.server.namenode.ha.TestXAttrsWithHA
Running org.apache.hadoop.hdfs.server.namenode.ha.TestStateTransitionFailure
Tests run: 1, Failures: 0, Errors: 0, Skipped: 0, Time elapsed: 4.232 sec - in org.apache.hadoop.hdfs.server.namenode.ha.TestStateTransitionFailure
Running org.apache.hadoop.hdfs.server.namenode.ha.TestPendingCorruptDnMessages
Tests run: 1, Failures: 0, Errors: 0, Skipped: 0, Time elapsed: 13.358 sec - in org.apache.hadoop.hdfs.server.namenode.ha.TestPendingCorruptDnMessages
Running org.apache.hadoop.hdfs.server.namenode.ha.TestRetryCacheWithHA
Tests run: 21, Failures: 0, Errors: 0, Skipped: 0, Time elapsed: 89.031 sec - in org.apache.hadoop.hdfs.server.namenode.ha.TestRetryCacheWithHA
Running org.apache.hadoop.hdfs.server.namenode.ha.TestStandbyCheckpoints
Tests run: 7, Failures: 0, Errors: 0, Skipped: 0, Time elapsed: 84.847 sec - in org.apache.hadoop.hdfs.server.namenode.ha.TestStandbyCheckpoints
Running org.apache.hadoop.hdfs.server.namenode.ha.TestDNFencingWithReplication
Tests run: 1, Failures: 0, Errors: 0, Skipped: 0, Time elapsed: 60.654 sec - in org.apache.hadoop.hdfs.server.namenode.ha.TestDNFencingWithReplication
Running org.apache.hadoop.hdfs.server.namenode.ha.TestBootstrapStandby
Tests run: 5, Failures: 0, Errors: 0, Skipped: 0, Time elapsed: 10.206 sec - in org.apache.hadoop.hdfs.server.namenode.ha.TestBootstrapStandby
Running org.apache.hadoop.hdfs.server.namenode.ha.TestDelegationTokensWithHA
Tests run: 6, Failures: 0, Errors: 0, Skipped: 0, Time elapsed: 9.988 sec - in org.apache.hadoop.hdfs.server.namenode.ha.TestDelegationTokensWithHA
Running org.apache.hadoop.hdfs.server.namenode.ha.TestPipelinesFailover
Tests run: 8, Failures: 0, Errors: 0, Skipped: 0, Time elapsed: 106.668 sec - in org.apache.hadoop.hdfs.server.namenode.ha.TestPipelinesFailover
Running org.apache.hadoop.hdfs.server.namenode.ha.TestDFSZKFailoverController
Tests run: 3, Failures: 0, Errors: 0, Skipped: 0, Time elapsed: 17.167 sec - in org.apache.hadoop.hdfs.server.namenode.ha.TestDFSZKFailoverController
Running org.apache.hadoop.hdfs.server.namenode.ha.TestFailoverWithBlockTokensEnabled
Tests run: 4, Failures: 0, Errors: 0, Skipped: 0, Time elapsed: 35.837 sec - in org.apache.hadoop.hdfs.server.namenode.ha.TestFailoverWithBlockTokensEnabled
Running org.apache.hadoop.hdfs.server.namenode.ha.TestEditLogTailer
Tests run: 3, Failures: 0, Errors: 0, Skipped: 0, Time elapsed: 9.847 sec - in org.apache.hadoop.hdfs.server.namenode.ha.TestEditLogTailer
Running org.apache.hadoop.hdfs.server.namenode.ha.TestNNHealthCheck
Tests run: 1, Failures: 0, Errors: 0, Skipped: 0, Time elapsed: 4.148 sec - in org.apache.hadoop.hdfs.server.namenode.ha.TestNNHealthCheck
Running org.apache.hadoop.hdfs.server.namenode.ha.TestBootstrapStandbyWithQJM
Tests run: 2, Failures: 0, Errors: 0, Skipped: 0, Time elapsed: 9.282 sec - in org.apache.hadoop.hdfs.server.namenode.ha.TestBootstrapStandbyWithQJM
Running org.apache.hadoop.hdfs.server.namenode.ha.TestHarFileSystemWithHA
Tests run: 1, Failures: 0, Errors: 0, Skipped: 0, Time elapsed: 4.727 sec - in org.apache.hadoop.hdfs.server.namenode.ha.TestHarFileSystemWithHA
Running org.apache.hadoop.hdfs.server.namenode.ha.TestHAAppend
Tests run: 1, Failures: 0, Errors: 0, Skipped: 0, Time elapsed: 6.792 sec - in org.apache.hadoop.hdfs.server.namenode.ha.TestHAAppend
Running org.apache.hadoop.hdfs.server.namenode.ha.TestHAConfiguration
Tests run: 4, Failures: 0, Errors: 0, Skipped: 0, Time elapsed: 1.253 sec - in org.apache.hadoop.hdfs.server.namenode.ha.TestHAConfiguration
Running org.apache.hadoop.hdfs.server.namenode.ha.TestQuotasWithHA
Tests run: 1, Failures: 0, Errors: 0, Skipped: 0, Time elapsed: 7.261 sec - in org.apache.hadoop.hdfs.server.namenode.ha.TestQuotasWithHA
Running org.apache.hadoop.hdfs.server.namenode.ha.TestHASafeMode
Tests run: 18, Failures: 0, Errors: 0, Skipped: 0, Time elapsed: 96.62 sec - in org.apache.hadoop.hdfs.server.namenode.ha.TestHASafeMode
Running org.apache.hadoop.hdfs.server.namenode.ha.TestLossyRetryInvocationHandler
Tests run: 1, Failures: 0, Errors: 0, Skipped: 0, Time elapsed: 4.369 sec - in org.apache.hadoop.hdfs.server.namenode.ha.TestLossyRetryInvocationHandler
Running org.apache.hadoop.hdfs.server.namenode.ha.TestEditLogsDuringFailover
Tests run: 3, Failures: 0, Errors: 0, Skipped: 0, Time elapsed: 7.748 sec - in org.apache.hadoop.hdfs.server.namenode.ha.TestEditLogsDuringFailover
Running org.apache.hadoop.hdfs.server.namenode.ha.TestDNFencing
Tests run: 6, Failures: 0, Errors: 0, Skipped: 0, Time elapsed: 46.698 sec - in org.apache.hadoop.hdfs.server.namenode.ha.TestDNFencing
Running org.apache.hadoop.hdfs.server.namenode.ha.TestGetGroupsWithHA
Tests run: 6, Failures: 0, Errors: 0, Skipped: 0, Time elapsed: 7.312 sec - in org.apache.hadoop.hdfs.server.namenode.ha.TestGetGroupsWithHA
Running org.apache.hadoop.hdfs.server.namenode.ha.TestHAMetrics
Tests run: 1, Failures: 0, Errors: 0, Skipped: 0, Time elapsed: 8.326 sec - in org.apache.hadoop.hdfs.server.namenode.ha.TestHAMetrics
Running org.apache.hadoop.hdfs.server.namenode.ha.TestHAFsck
Tests run: 1, Failures: 0, Errors: 0, Skipped: 0, Time elapsed: 5.028 sec - in org.apache.hadoop.hdfs.server.namenode.ha.TestHAFsck
Running org.apache.hadoop.hdfs.server.namenode.ha.TestFailureToReadEdits
Tests run: 6, Failures: 0, Errors: 0, Skipped: 0, Time elapsed: 87.23 sec - in org.apache.hadoop.hdfs.server.namenode.ha.TestFailureToReadEdits
Running org.apache.hadoop.hdfs.server.namenode.ha.TestInitializeSharedEdits
Tests run: 4, Failures: 0, Errors: 0, Skipped: 0, Time elapsed: 13.768 sec - in org.apache.hadoop.hdfs.server.namenode.ha.TestInitializeSharedEdits
Running org.apache.hadoop.hdfs.qjournal.client.TestIPCLoggerChannel
Tests run: 3, Failures: 0, Errors: 0, Skipped: 0, Time elapsed: 1.014 sec - in org.apache.hadoop.hdfs.qjournal.client.TestIPCLoggerChannel
Running org.apache.hadoop.hdfs.qjournal.client.TestQuorumJournalManagerUnit
Tests run: 6, Failures: 0, Errors: 0, Skipped: 0, Time elapsed: 1.307 sec - in org.apache.hadoop.hdfs.qjournal.client.TestQuorumJournalManagerUnit
Running org.apache.hadoop.hdfs.qjournal.client.TestQJMWithFaults
Tests run: 2, Failures: 0, Errors: 0, Skipped: 0, Time elapsed: 188.973 sec - in org.apache.hadoop.hdfs.qjournal.client.TestQJMWithFaults
Running org.apache.hadoop.hdfs.qjournal.client.TestSegmentRecoveryComparator
Tests run: 1, Failures: 0, Errors: 0, Skipped: 0, Time elapsed: 0.29 sec - in org.apache.hadoop.hdfs.qjournal.client.TestSegmentRecoveryComparator
Running org.apache.hadoop.hdfs.qjournal.client.TestEpochsAreUnique
Tests run: 1, Failures: 0, Errors: 0, Skipped: 0, Time elapsed: 7.062 sec - in org.apache.hadoop.hdfs.qjournal.client.TestEpochsAreUnique
Running org.apache.hadoop.hdfs.qjournal.client.TestQuorumCall
Tests run: 1, Failures: 0, Errors: 0, Skipped: 0, Time elapsed: 0.254 sec - in org.apache.hadoop.hdfs.qjournal.client.TestQuorumCall
Running org.apache.hadoop.hdfs.qjournal.client.TestQuorumJournalManager
Tests run: 21, Failures: 0, Errors: 0, Skipped: 0, Time elapsed: 26.699 sec - in org.apache.hadoop.hdfs.qjournal.client.TestQuorumJournalManager
Running org.apache.hadoop.hdfs.qjournal.TestMiniJournalCluster
Tests run: 1, Failures: 0, Errors: 0, Skipped: 0, Time elapsed: 1.654 sec - in org.apache.hadoop.hdfs.qjournal.TestMiniJournalCluster
Running org.apache.hadoop.hdfs.qjournal.server.TestJournal
Tests run: 12, Failures: 0, Errors: 0, Skipped: 0, Time elapsed: 2.316 sec - in org.apache.hadoop.hdfs.qjournal.server.TestJournal
Running org.apache.hadoop.hdfs.qjournal.server.TestJournalNode
Tests run: 6, Failures: 0, Errors: 0, Skipped: 0, Time elapsed: 5.945 sec - in org.apache.hadoop.hdfs.qjournal.server.TestJournalNode
Running org.apache.hadoop.hdfs.qjournal.server.TestJournalNodeMXBean
Tests run: 1, Failures: 0, Errors: 0, Skipped: 0, Time elapsed: 1.362 sec - in org.apache.hadoop.hdfs.qjournal.server.TestJournalNodeMXBean
Running org.apache.hadoop.hdfs.qjournal.TestNNWithQJM
Tests run: 3, Failures: 0, Errors: 0, Skipped: 0, Time elapsed: 8.754 sec - in org.apache.hadoop.hdfs.qjournal.TestNNWithQJM
Running org.apache.hadoop.hdfs.TestSetTimes
Tests run: 3, Failures: 0, Errors: 0, Skipped: 0, Time elapsed: 10.645 sec - in org.apache.hadoop.hdfs.TestSetTimes
Running org.apache.hadoop.hdfs.TestDFSStorageStateRecovery
Tests run: 3, Failures: 0, Errors: 0, Skipped: 0, Time elapsed: 99.184 sec - in org.apache.hadoop.hdfs.TestDFSStorageStateRecovery
Running org.apache.hadoop.hdfs.TestIsMethodSupported
Tests run: 10, Failures: 0, Errors: 0, Skipped: 0, Time elapsed: 4.318 sec - in org.apache.hadoop.hdfs.TestIsMethodSupported
Running org.apache.hadoop.hdfs.TestClientProtocolForPipelineRecovery
Tests run: 4, Failures: 0, Errors: 0, Skipped: 0, Time elapsed: 39.957 sec - in org.apache.hadoop.hdfs.TestClientProtocolForPipelineRecovery
Running org.apache.hadoop.hdfs.TestDFSRollback
Tests run: 1, Failures: 0, Errors: 0, Skipped: 0, Time elapsed: 18.961 sec - in org.apache.hadoop.hdfs.TestDFSRollback
Running org.apache.hadoop.hdfs.TestPread
Tests run: 6, Failures: 0, Errors: 0, Skipped: 0, Time elapsed: 103.771 sec - in org.apache.hadoop.hdfs.TestPread
Running org.apache.hadoop.hdfs.TestModTime
Tests run: 2, Failures: 0, Errors: 0, Skipped: 0, Time elapsed: 15.929 sec - in org.apache.hadoop.hdfs.TestModTime
Running org.apache.hadoop.hdfs.TestDFSShellGenericOptions
Tests run: 1, Failures: 0, Errors: 0, Skipped: 0, Time elapsed: 4.35 sec - in org.apache.hadoop.hdfs.TestDFSShellGenericOptions
Running org.apache.hadoop.hdfs.TestSmallBlock
Tests run: 2, Failures: 0, Errors: 0, Skipped: 0, Time elapsed: 5.527 sec - in org.apache.hadoop.hdfs.TestSmallBlock
Running org.apache.hadoop.hdfs.TestFileCreationClient
Tests run: 1, Failures: 0, Errors: 0, Skipped: 0, Time elapsed: 50.767 sec - in org.apache.hadoop.hdfs.TestFileCreationClient
Running org.apache.hadoop.net.TestNetworkTopology
Tests run: 10, Failures: 0, Errors: 0, Skipped: 0, Time elapsed: 9.251 sec - in org.apache.hadoop.net.TestNetworkTopology
Running org.apache.hadoop.security.TestPermission
Tests run: 3, Failures: 0, Errors: 0, Skipped: 0, Time elapsed: 6.097 sec - in org.apache.hadoop.security.TestPermission
Running org.apache.hadoop.security.TestRefreshUserMappings
Tests run: 2, Failures: 0, Errors: 0, Skipped: 0, Time elapsed: 5.93 sec - in org.apache.hadoop.security.TestRefreshUserMappings
Running org.apache.hadoop.security.TestPermissionSymlinks
Tests run: 14, Failures: 0, Errors: 0, Skipped: 0, Time elapsed: 5.258 sec - in org.apache.hadoop.security.TestPermissionSymlinks
Running org.apache.hadoop.cli.TestHDFSCLI
Tests run: 1, Failures: 0, Errors: 0, Skipped: 0, Time elapsed: 61.286 sec - in org.apache.hadoop.cli.TestHDFSCLI
Running org.apache.hadoop.cli.TestAclCLI
Tests run: 1, Failures: 0, Errors: 0, Skipped: 0, Time elapsed: 6.356 sec - in org.apache.hadoop.cli.TestAclCLI
Running org.apache.hadoop.cli.TestXAttrCLI
Tests run: 1, Failures: 0, Errors: 0, Skipped: 0, Time elapsed: 7.549 sec - in org.apache.hadoop.cli.TestXAttrCLI
Running org.apache.hadoop.cli.TestCacheAdminCLI
Tests run: 1, Failures: 0, Errors: 0, Skipped: 0, Time elapsed: 6.659 sec - in org.apache.hadoop.cli.TestCacheAdminCLI
Running org.apache.hadoop.tools.TestJMXGet
Tests run: 2, Failures: 0, Errors: 0, Skipped: 0, Time elapsed: 5.676 sec - in org.apache.hadoop.tools.TestJMXGet
Running org.apache.hadoop.tools.TestTools
Tests run: 5, Failures: 0, Errors: 0, Skipped: 0, Time elapsed: 1.303 sec - in org.apache.hadoop.tools.TestTools

Results :

Failed tests: 
  TestDistributedFileSystem.testGetFileBlockStorageLocationsError:837 Expected one valid and
one invalid volume
  TestBPOfferService.testBasicFunctionality:175 
Wanted but not invoked:
datanodeProtocolClientSideTranslatorPB.registerDatanode(
    <any>
);
-> at org.apache.hadoop.hdfs.server.datanode.TestBPOfferService.testBasicFunctionality(TestBPOfferService.java:175)
Actually, there were zero interactions with this mock.


Tests in error: 
  TestCrcCorruption.testCorruptionDuringWrt:133->Object.wait:-2 ยป  test timed ou...

Tests run: 2735, Failures: 2, Errors: 1, Skipped: 17

[INFO]                                                                         
[INFO] ------------------------------------------------------------------------
[INFO] Skipping Apache Hadoop HttpFS
[INFO] This project has been banned from the build due to previous failures.
[INFO] ------------------------------------------------------------------------
[INFO]                                                                         
[INFO] ------------------------------------------------------------------------
[INFO] Skipping Apache Hadoop HDFS BookKeeper Journal
[INFO] This project has been banned from the build due to previous failures.
[INFO] ------------------------------------------------------------------------
[INFO]                                                                         
[INFO] ------------------------------------------------------------------------
[INFO] Skipping Apache Hadoop HDFS-NFS
[INFO] This project has been banned from the build due to previous failures.
[INFO] ------------------------------------------------------------------------
[INFO]                                                                         
[INFO] ------------------------------------------------------------------------
[INFO] Building Apache Hadoop HDFS Project 3.0.0-SNAPSHOT
[INFO] ------------------------------------------------------------------------
[WARNING] The POM for org.eclipse.m2e:lifecycle-mapping:jar:1.0.0 is missing, no dependency
information available
[WARNING] Failed to retrieve plugin descriptor for org.eclipse.m2e:lifecycle-mapping:1.0.0:
Plugin org.eclipse.m2e:lifecycle-mapping:1.0.0 or one of its dependencies could not be resolved:
Failed to read artifact descriptor for org.eclipse.m2e:lifecycle-mapping:jar:1.0.0
[INFO] 
[INFO] --- maven-clean-plugin:2.4.1:clean (default-clean) @ hadoop-hdfs-project ---
[INFO] Deleting <https://builds.apache.org/job/Hadoop-Hdfs-trunk/ws/trunk/hadoop-hdfs-project/target>
[INFO] 
[INFO] --- maven-antrun-plugin:1.7:run (create-testdirs) @ hadoop-hdfs-project ---
[INFO] Executing tasks

main:
    [mkdir] Created dir: <https://builds.apache.org/job/Hadoop-Hdfs-trunk/ws/trunk/hadoop-hdfs-project/target/test-dir>
[INFO] Executed tasks
[INFO] 
[INFO] --- maven-source-plugin:2.1.2:jar-no-fork (hadoop-java-sources) @ hadoop-hdfs-project
---
[INFO] 
[INFO] --- maven-source-plugin:2.1.2:test-jar-no-fork (hadoop-java-sources) @ hadoop-hdfs-project
---
[INFO] 
[INFO] --- maven-enforcer-plugin:1.3.1:enforce (dist-enforce) @ hadoop-hdfs-project ---
[INFO] 
[INFO] --- maven-site-plugin:3.3:attach-descriptor (attach-descriptor) @ hadoop-hdfs-project
---
[INFO] 
[INFO] --- maven-javadoc-plugin:2.8.1:jar (module-javadocs) @ hadoop-hdfs-project ---
[INFO] Not executing Javadoc as the project is not a Java classpath-capable package
[INFO] 
[INFO] --- maven-enforcer-plugin:1.3.1:enforce (depcheck) @ hadoop-hdfs-project ---
[INFO] 
[INFO] --- maven-checkstyle-plugin:2.6:checkstyle (default-cli) @ hadoop-hdfs-project ---
[INFO] 
[INFO] --- findbugs-maven-plugin:2.3.2:findbugs (default-cli) @ hadoop-hdfs-project ---
[INFO] ****** FindBugsMojo execute *******
[INFO] canGenerate is false
[INFO] ------------------------------------------------------------------------
[INFO] Reactor Summary:
[INFO] 
[INFO] Apache Hadoop HDFS ................................ FAILURE [2:18:38.129s]
[INFO] Apache Hadoop HttpFS .............................. SKIPPED
[INFO] Apache Hadoop HDFS BookKeeper Journal ............. SKIPPED
[INFO] Apache Hadoop HDFS-NFS ............................ SKIPPED
[INFO] Apache Hadoop HDFS Project ........................ SUCCESS [2.564s]
[INFO] ------------------------------------------------------------------------
[INFO] BUILD FAILURE
[INFO] ------------------------------------------------------------------------
[INFO] Total time: 2:18:42.400s
[INFO] Finished at: Thu May 29 13:57:16 UTC 2014
[INFO] Final Memory: 31M/328M
[INFO] ------------------------------------------------------------------------
[ERROR] Failed to execute goal org.apache.maven.plugins:maven-surefire-plugin:2.16:test (default-test)
on project hadoop-hdfs: There are test failures.
[ERROR] 
[ERROR] Please refer to <https://builds.apache.org/job/Hadoop-Hdfs-trunk/ws/trunk/hadoop-hdfs-project/hadoop-hdfs/target/surefire-reports>
for the individual test results.
[ERROR] -> [Help 1]
[ERROR] 
[ERROR] To see the full stack trace of the errors, re-run Maven with the -e switch.
[ERROR] Re-run Maven using the -X switch to enable full debug logging.
[ERROR] 
[ERROR] For more information about the errors and possible solutions, please read the following
articles:
[ERROR] [Help 1] http://cwiki.apache.org/confluence/display/MAVEN/MojoFailureException
Build step 'Execute shell' marked build as failure
Archiving artifacts
Recording test results
Updating YARN-2107
Updating MAPREDUCE-5895
Updating HDFS-6448
Updating YARN-596
Updating HDFS-6442
Updating HDFS-6453
Updating HADOOP-10625
Updating MAPREDUCE-5862

Mime
View raw message