hadoop-hdfs-dev mailing list archives

Site index · List index
Message view « Date » · « Thread »
Top « Date » · « Thread »
From Apache Jenkins Server <jenk...@builds.apache.org>
Subject Hadoop-Hdfs-trunk - Build # 1754 - Still Failing
Date Tue, 20 May 2014 13:57:39 GMT
See https://builds.apache.org/job/Hadoop-Hdfs-trunk/1754/

###################################################################################
########################## LAST 60 LINES OF THE CONSOLE ###########################
[...truncated 18037 lines...]
[INFO] ------------------------------------------------------------------------
[INFO] Reactor Summary:
[INFO] 
[INFO] Apache Hadoop HDFS ................................ SUCCESS [2:16:57.303s]
[INFO] Apache Hadoop HttpFS .............................. SUCCESS [3:03.990s]
[INFO] Apache Hadoop HDFS BookKeeper Journal ............. FAILURE [1:14.196s]
[INFO] Apache Hadoop HDFS-NFS ............................ SUCCESS [1:17.460s]
[INFO] Apache Hadoop HDFS Project ........................ SUCCESS [0.042s]
[INFO] ------------------------------------------------------------------------
[INFO] BUILD FAILURE
[INFO] ------------------------------------------------------------------------
[INFO] Total time: 2:22:34.303s
[INFO] Finished at: Tue May 20 13:56:16 UTC 2014
[INFO] Final Memory: 56M/748M
[INFO] ------------------------------------------------------------------------
[ERROR] Failed to execute goal org.apache.maven.plugins:maven-surefire-plugin:2.16:test (default-test)
on project hadoop-hdfs-bkjournal: There are test failures.
[ERROR] 
[ERROR] Please refer to /home/jenkins/jenkins-slave/workspace/Hadoop-Hdfs-trunk/trunk/hadoop-hdfs-project/hadoop-hdfs/src/contrib/bkjournal/target/surefire-reports
for the individual test results.
[ERROR] -> [Help 1]
[ERROR] 
[ERROR] To see the full stack trace of the errors, re-run Maven with the -e switch.
[ERROR] Re-run Maven using the -X switch to enable full debug logging.
[ERROR] 
[ERROR] For more information about the errors and possible solutions, please read the following
articles:
[ERROR] [Help 1] http://cwiki.apache.org/confluence/display/MAVEN/MojoFailureException
[ERROR] 
[ERROR] After correcting the problems, you can resume the build with the command
[ERROR]   mvn <goals> -rf :hadoop-hdfs-bkjournal
Build step 'Execute shell' marked build as failure
Archiving artifacts
Recording test results
Updating HDFS-6362
Updating HDFS-6361
Updating YARN-2066
Updating HDFS-6287
Updating HDFS-4913
Updating HADOOP-10614
Updating HDFS-5683
Updating HADOOP-10612
Updating MAPREDUCE-5867
Updating HDFS-6250
Updating HADOOP-10489
Updating YARN-2053
Updating HADOOP-10401
Updating HDFS-6397
Updating HADOOP-10586
Updating MAPREDUCE-5861
Updating HDFS-2949
Updating HDFS-6406
Updating HADOOP-10609
Updating MAPREDUCE-5809
Updating HDFS-6345
Updating HDFS-6400
Updating HDFS-6326
Updating HDFS-6325
Updating HDFS-6402
Sending e-mails to: hdfs-dev@hadoop.apache.org
Email was triggered for: Failure
Sending email for trigger: Failure



###################################################################################
############################## FAILED TESTS (if any) ##############################
All tests passed
Mime
  • Unnamed multipart/mixed (inline, None, 0 bytes)
View raw message