hadoop-hdfs-dev mailing list archives

Site index · List index
Message view « Date » · « Thread »
Top « Date » · « Thread »
From Apache Jenkins Server <jenk...@builds.apache.org>
Subject Hadoop-Hdfs-trunk - Build # 1728 - Still Failing
Date Thu, 10 Apr 2014 19:08:55 GMT
See https://builds.apache.org/job/Hadoop-Hdfs-trunk/1728/

###################################################################################
########################## LAST 60 LINES OF THE CONSOLE ###########################
[...truncated 12937 lines...]
[INFO] --- maven-javadoc-plugin:2.8.1:jar (module-javadocs) @ hadoop-hdfs-project ---
[INFO] Not executing Javadoc as the project is not a Java classpath-capable package
[INFO] 
[INFO] --- maven-enforcer-plugin:1.3.1:enforce (depcheck) @ hadoop-hdfs-project ---
[INFO] 
[INFO] --- maven-checkstyle-plugin:2.6:checkstyle (default-cli) @ hadoop-hdfs-project ---
[INFO] 
[INFO] --- findbugs-maven-plugin:2.3.2:findbugs (default-cli) @ hadoop-hdfs-project ---
[INFO] ****** FindBugsMojo execute *******
[INFO] canGenerate is false
[INFO] ------------------------------------------------------------------------
[INFO] Reactor Summary:
[INFO] 
[INFO] Apache Hadoop HDFS ................................ FAILURE [2:08:18.172s]
[INFO] Apache Hadoop HttpFS .............................. SKIPPED
[INFO] Apache Hadoop HDFS BookKeeper Journal ............. SKIPPED
[INFO] Apache Hadoop HDFS-NFS ............................ SKIPPED
[INFO] Apache Hadoop HDFS Project ........................ SUCCESS [4.038s]
[INFO] ------------------------------------------------------------------------
[INFO] BUILD FAILURE
[INFO] ------------------------------------------------------------------------
[INFO] Total time: 2:08:23.997s
[INFO] Finished at: Thu Apr 10 19:07:47 UTC 2014
[INFO] Final Memory: 32M/317M
[INFO] ------------------------------------------------------------------------
[ERROR] Failed to execute goal org.apache.maven.plugins:maven-surefire-plugin:2.16:test (default-test)
on project hadoop-hdfs: There are test failures.
[ERROR] 
[ERROR] Please refer to /home/jenkins/jenkins-slave/workspace/Hadoop-Hdfs-trunk/trunk/hadoop-hdfs-project/hadoop-hdfs/target/surefire-reports
for the individual test results.
[ERROR] -> [Help 1]
[ERROR] 
[ERROR] To see the full stack trace of the errors, re-run Maven with the -e switch.
[ERROR] Re-run Maven using the -X switch to enable full debug logging.
[ERROR] 
[ERROR] For more information about the errors and possible solutions, please read the following
articles:
[ERROR] [Help 1] http://cwiki.apache.org/confluence/display/MAVEN/MojoFailureException
Build step 'Execute shell' marked build as failure
Archiving artifacts
Recording test results
Updating HDFS-6170
Updating HADOOP-10485
Updating HDFS-6160
Updating HADOOP-10473
Updating HADOOP-10432
Updating HDFS-6209
Updating YARN-1910
Updating HDFS-6208
Updating HADOOP-10427
Updating HADOOP-10428
Updating YARN-1907
Updating HDFS-6225
Updating HDFS-6204
Updating HDFS-6215
Updating HADOOP-10429
Updating MAPREDUCE-5824
Updating HDFS-6228
Updating HDFS-6206
Sending e-mails to: hdfs-dev@hadoop.apache.org
Email was triggered for: Failure
Sending email for trigger: Failure



###################################################################################
############################## FAILED TESTS (if any) ##############################
1 tests failed.
REGRESSION:  org.apache.hadoop.hdfs.server.balancer.TestBalancerWithNodeGroup.testBalancerWithRackLocality

Error Message:
expected:<1800> but was:<1810>

Stack Trace:
java.lang.AssertionError: expected:<1800> but was:<1810>
	at org.junit.Assert.fail(Assert.java:93)
	at org.junit.Assert.failNotEquals(Assert.java:647)
	at org.junit.Assert.assertEquals(Assert.java:128)
	at org.junit.Assert.assertEquals(Assert.java:147)
	at org.apache.hadoop.hdfs.server.balancer.TestBalancerWithNodeGroup.testBalancerWithRackLocality(TestBalancerWithNodeGroup.java:253)



Mime
  • Unnamed multipart/mixed (inline, None, 0 bytes)
View raw message