hadoop-hdfs-dev mailing list archives

Site index · List index
Message view « Date » · « Thread »
Top « Date » · « Thread »
From Apache Jenkins Server <jenk...@builds.apache.org>
Subject Build failed in Jenkins: Hadoop-Hdfs-trunk #1729
Date Fri, 11 Apr 2014 13:48:08 GMT
See <https://builds.apache.org/job/Hadoop-Hdfs-trunk/1729/changes>

Changes:

[cnauroth] HADOOP-10490. TestMapFile and TestBloomMapFile leak file descriptors. Contributed
by Chris Nauroth.

[vinodkv] MAPREDUCE-5826. Fixed HistoryServerFileSystemStore to use right permissions on Windows
for temporary files and thus also fix the test-issue with
TestHistoryServerFileSystemStateStoreService. Contributed by Varun Vasudev.

[vinodkv] YARN-1926. Changed DistributedShell to use appIDs as unique identifiers for HDFS
paths and thus avoid test failures on Windows. Contributed by Varun Vasudev.

[vinodkv] MAPREDUCE-5815. Fixed test-failure of TestMRAppMaster by making MRAppMaster gracefully
handle empty-queue names. Contributed by Akira Ajisaka.

[cnauroth] HDFS-6231. DFSClient hangs infinitely if using hedged reads and all eligible datanodes
die. Contributed by Chris Nauroth.

[zjshen] YARN-1924. Made ZKRMStateStore updateApplication(Attempt)StateInternal work when
Application(Attempt) state hasn't been stored before. Contributed by Jian He.

[jianhe] YARN-1903. Set exit code and diagnostics when container is killed at NEW/LOCALIZING
state. Contributed by Zhijie Shen

[wang] Undo accidental FSNamesystem change introduced in HDFS-6224 commit.

[wang] HDFS-6224. Add a unit test to TestAuditLogger for file permissions passed to logAuditEvent.
Contributed by Charles Lamb.

[jlowe] MAPREDUCE-5825. Provide diagnostics for reducers killed during ramp down. Contributed
by Gera Shegalov

[vinodkv] YARN-1914. Fixed resource-download on NodeManagers to skip permission verification
of public cache files in Windows+local file-system environment. Contribued by Varun Vasudev.

[vinayakumarb] HADOOP-10350. BUILDING.txt should mention openssl dependency required for hadoop-pipes
(Vinayakumar B)

[vinayakumarb] Reverse merged revision(s) 1586425 from hadoop/common/trunk:
HADOOP-10350. BUILDING.txt should mention openssl dependency required for hadoop-pipes (Vinayakumar
B)
........

[vinayakumarb] HADOOP-10350. BUILDING.txt should mention openssl dependency required for hadoop-pipes
(Vinayakumar B)

[zjshen] YARN-1920. Fixed TestFileSystemApplicationHistoryStore failure on windows. Contributed
by Vinod Kumar Vavilapalli.

[umamahesh] HDFS-5669. Storage#tryLock() should check for null before logging successfull
message. Contributed by Vinayakumar B

[tucu] HADOOP-10488. TestKeyProviderFactory fails randomly. (tucu)

------------------------------------------
[...truncated 13843 lines...]
Tests run: 5, Failures: 0, Errors: 0, Skipped: 0, Time elapsed: 0.31 sec - in org.apache.hadoop.hdfs.server.namenode.TestNameNodeResourcePolicy
Running org.apache.hadoop.hdfs.server.namenode.TestSaveNamespace
Tests run: 13, Failures: 0, Errors: 0, Skipped: 0, Time elapsed: 13.832 sec - in org.apache.hadoop.hdfs.server.namenode.TestSaveNamespace
Running org.apache.hadoop.hdfs.server.namenode.TestNamenodeCapacityReport
Tests run: 1, Failures: 0, Errors: 0, Skipped: 0, Time elapsed: 3.805 sec - in org.apache.hadoop.hdfs.server.namenode.TestNamenodeCapacityReport
Running org.apache.hadoop.hdfs.server.namenode.TestCheckPointForSecurityTokens
Tests run: 1, Failures: 0, Errors: 0, Skipped: 0, Time elapsed: 8.56 sec - in org.apache.hadoop.hdfs.server.namenode.TestCheckPointForSecurityTokens
Running org.apache.hadoop.hdfs.server.namenode.TestNameNodeResourceChecker
Tests run: 6, Failures: 0, Errors: 0, Skipped: 0, Time elapsed: 4.937 sec - in org.apache.hadoop.hdfs.server.namenode.TestNameNodeResourceChecker
Running org.apache.hadoop.hdfs.server.namenode.TestNameNodeAcl
Tests run: 60, Failures: 0, Errors: 0, Skipped: 0, Time elapsed: 7.056 sec - in org.apache.hadoop.hdfs.server.namenode.TestNameNodeAcl
Running org.apache.hadoop.hdfs.server.namenode.TestFSPermissionChecker
Tests run: 15, Failures: 0, Errors: 0, Skipped: 0, Time elapsed: 0.649 sec - in org.apache.hadoop.hdfs.server.namenode.TestFSPermissionChecker
Running org.apache.hadoop.hdfs.server.namenode.TestAddBlock
Tests run: 2, Failures: 0, Errors: 0, Skipped: 0, Time elapsed: 22.912 sec - in org.apache.hadoop.hdfs.server.namenode.TestAddBlock
Running org.apache.hadoop.hdfs.server.namenode.TestLeaseManager
Tests run: 1, Failures: 0, Errors: 0, Skipped: 0, Time elapsed: 3.392 sec - in org.apache.hadoop.hdfs.server.namenode.TestLeaseManager
Running org.apache.hadoop.hdfs.server.namenode.TestCheckpoint
Tests run: 37, Failures: 0, Errors: 0, Skipped: 0, Time elapsed: 79.16 sec - in org.apache.hadoop.hdfs.server.namenode.TestCheckpoint
Running org.apache.hadoop.hdfs.server.namenode.TestFSNamesystem
Tests run: 6, Failures: 0, Errors: 0, Skipped: 0, Time elapsed: 2.815 sec - in org.apache.hadoop.hdfs.server.namenode.TestFSNamesystem
Running org.apache.hadoop.hdfs.server.namenode.TestNNStorageRetentionManager
Tests run: 9, Failures: 0, Errors: 0, Skipped: 0, Time elapsed: 1.053 sec - in org.apache.hadoop.hdfs.server.namenode.TestNNStorageRetentionManager
Running org.apache.hadoop.hdfs.server.namenode.TestCorruptFilesJsp
Tests run: 1, Failures: 0, Errors: 0, Skipped: 0, Time elapsed: 13.53 sec - in org.apache.hadoop.hdfs.server.namenode.TestCorruptFilesJsp
Running org.apache.hadoop.hdfs.server.namenode.TestBlockUnderConstruction
Tests run: 2, Failures: 0, Errors: 0, Skipped: 0, Time elapsed: 4.334 sec - in org.apache.hadoop.hdfs.server.namenode.TestBlockUnderConstruction
Running org.apache.hadoop.hdfs.server.namenode.ha.TestFailureOfSharedDir
Tests run: 4, Failures: 0, Errors: 0, Skipped: 0, Time elapsed: 8.37 sec - in org.apache.hadoop.hdfs.server.namenode.ha.TestFailureOfSharedDir
Running org.apache.hadoop.hdfs.server.namenode.ha.TestStandbyIsHot
Tests run: 2, Failures: 0, Errors: 0, Skipped: 0, Time elapsed: 17.841 sec - in org.apache.hadoop.hdfs.server.namenode.ha.TestStandbyIsHot
Running org.apache.hadoop.hdfs.server.namenode.ha.TestDFSUpgradeWithHA
Tests run: 9, Failures: 0, Errors: 0, Skipped: 0, Time elapsed: 28.166 sec - in org.apache.hadoop.hdfs.server.namenode.ha.TestDFSUpgradeWithHA
Running org.apache.hadoop.hdfs.server.namenode.ha.TestHAStateTransitions
Tests run: 11, Failures: 0, Errors: 0, Skipped: 0, Time elapsed: 79.705 sec - in org.apache.hadoop.hdfs.server.namenode.ha.TestHAStateTransitions
Running org.apache.hadoop.hdfs.server.namenode.ha.TestStateTransitionFailure
Tests run: 1, Failures: 0, Errors: 0, Skipped: 0, Time elapsed: 4.282 sec - in org.apache.hadoop.hdfs.server.namenode.ha.TestStateTransitionFailure
Running org.apache.hadoop.hdfs.server.namenode.ha.TestRetryCacheWithHA
Tests run: 20, Failures: 0, Errors: 0, Skipped: 0, Time elapsed: 85.248 sec - in org.apache.hadoop.hdfs.server.namenode.ha.TestRetryCacheWithHA
Running org.apache.hadoop.hdfs.server.namenode.ha.TestStandbyCheckpoints
Tests run: 7, Failures: 0, Errors: 0, Skipped: 0, Time elapsed: 57.049 sec - in org.apache.hadoop.hdfs.server.namenode.ha.TestStandbyCheckpoints
Running org.apache.hadoop.hdfs.server.namenode.ha.TestHAWebUI
Tests run: 1, Failures: 0, Errors: 0, Skipped: 0, Time elapsed: 4.513 sec - in org.apache.hadoop.hdfs.server.namenode.ha.TestHAWebUI
Running org.apache.hadoop.hdfs.server.namenode.ha.TestDNFencingWithReplication
Tests run: 1, Failures: 0, Errors: 0, Skipped: 0, Time elapsed: 60.462 sec - in org.apache.hadoop.hdfs.server.namenode.ha.TestDNFencingWithReplication
Running org.apache.hadoop.hdfs.server.namenode.ha.TestBootstrapStandby
Tests run: 5, Failures: 0, Errors: 0, Skipped: 0, Time elapsed: 10.675 sec - in org.apache.hadoop.hdfs.server.namenode.ha.TestBootstrapStandby
Running org.apache.hadoop.hdfs.server.namenode.ha.TestDelegationTokensWithHA
Tests run: 6, Failures: 0, Errors: 0, Skipped: 0, Time elapsed: 10.406 sec - in org.apache.hadoop.hdfs.server.namenode.ha.TestDelegationTokensWithHA
Running org.apache.hadoop.hdfs.server.namenode.ha.TestPipelinesFailover
Tests run: 8, Failures: 0, Errors: 0, Skipped: 0, Time elapsed: 106.888 sec - in org.apache.hadoop.hdfs.server.namenode.ha.TestPipelinesFailover
Running org.apache.hadoop.hdfs.server.namenode.ha.TestDFSZKFailoverController
Tests run: 3, Failures: 0, Errors: 0, Skipped: 0, Time elapsed: 16.803 sec - in org.apache.hadoop.hdfs.server.namenode.ha.TestDFSZKFailoverController
Running org.apache.hadoop.hdfs.server.namenode.ha.TestFailoverWithBlockTokensEnabled
Tests run: 4, Failures: 0, Errors: 0, Skipped: 0, Time elapsed: 35.496 sec - in org.apache.hadoop.hdfs.server.namenode.ha.TestFailoverWithBlockTokensEnabled
Running org.apache.hadoop.hdfs.server.namenode.ha.TestEditLogTailer
Tests run: 3, Failures: 0, Errors: 0, Skipped: 0, Time elapsed: 10.295 sec - in org.apache.hadoop.hdfs.server.namenode.ha.TestEditLogTailer
Running org.apache.hadoop.hdfs.server.namenode.ha.TestNNHealthCheck
Tests run: 1, Failures: 0, Errors: 0, Skipped: 0, Time elapsed: 3.905 sec - in org.apache.hadoop.hdfs.server.namenode.ha.TestNNHealthCheck
Running org.apache.hadoop.hdfs.server.namenode.ha.TestBootstrapStandbyWithQJM
Tests run: 2, Failures: 0, Errors: 0, Skipped: 0, Time elapsed: 8.664 sec - in org.apache.hadoop.hdfs.server.namenode.ha.TestBootstrapStandbyWithQJM
Running org.apache.hadoop.hdfs.server.namenode.ha.TestHarFileSystemWithHA
Tests run: 1, Failures: 0, Errors: 0, Skipped: 0, Time elapsed: 4.515 sec - in org.apache.hadoop.hdfs.server.namenode.ha.TestHarFileSystemWithHA
Running org.apache.hadoop.hdfs.server.namenode.ha.TestHAAppend
Tests run: 1, Failures: 0, Errors: 0, Skipped: 0, Time elapsed: 6.23 sec - in org.apache.hadoop.hdfs.server.namenode.ha.TestHAAppend
Running org.apache.hadoop.hdfs.server.namenode.ha.TestHAConfiguration
Tests run: 4, Failures: 0, Errors: 0, Skipped: 0, Time elapsed: 1.166 sec - in org.apache.hadoop.hdfs.server.namenode.ha.TestHAConfiguration
Running org.apache.hadoop.hdfs.server.namenode.ha.TestQuotasWithHA
Tests run: 1, Failures: 0, Errors: 0, Skipped: 0, Time elapsed: 7.512 sec - in org.apache.hadoop.hdfs.server.namenode.ha.TestQuotasWithHA
Running org.apache.hadoop.hdfs.server.namenode.ha.TestHASafeMode
Tests run: 18, Failures: 0, Errors: 0, Skipped: 0, Time elapsed: 97.832 sec - in org.apache.hadoop.hdfs.server.namenode.ha.TestHASafeMode
Running org.apache.hadoop.hdfs.server.namenode.ha.TestLossyRetryInvocationHandler
Tests run: 1, Failures: 0, Errors: 0, Skipped: 0, Time elapsed: 4.333 sec - in org.apache.hadoop.hdfs.server.namenode.ha.TestLossyRetryInvocationHandler
Running org.apache.hadoop.hdfs.server.namenode.ha.TestEditLogsDuringFailover
Tests run: 3, Failures: 0, Errors: 0, Skipped: 0, Time elapsed: 8.366 sec - in org.apache.hadoop.hdfs.server.namenode.ha.TestEditLogsDuringFailover
Running org.apache.hadoop.hdfs.server.namenode.ha.TestDNFencing
Tests run: 6, Failures: 0, Errors: 0, Skipped: 0, Time elapsed: 46.263 sec - in org.apache.hadoop.hdfs.server.namenode.ha.TestDNFencing
Running org.apache.hadoop.hdfs.server.namenode.ha.TestGetGroupsWithHA
Tests run: 6, Failures: 0, Errors: 0, Skipped: 0, Time elapsed: 7.13 sec - in org.apache.hadoop.hdfs.server.namenode.ha.TestGetGroupsWithHA
Running org.apache.hadoop.hdfs.server.namenode.ha.TestHAMetrics
Tests run: 1, Failures: 0, Errors: 0, Skipped: 0, Time elapsed: 7.725 sec - in org.apache.hadoop.hdfs.server.namenode.ha.TestHAMetrics
Running org.apache.hadoop.hdfs.server.namenode.ha.TestHAFsck
Tests run: 1, Failures: 0, Errors: 0, Skipped: 0, Time elapsed: 6.045 sec - in org.apache.hadoop.hdfs.server.namenode.ha.TestHAFsck
Running org.apache.hadoop.hdfs.server.namenode.ha.TestFailureToReadEdits
Tests run: 6, Failures: 0, Errors: 0, Skipped: 0, Time elapsed: 89.032 sec - in org.apache.hadoop.hdfs.server.namenode.ha.TestFailureToReadEdits
Running org.apache.hadoop.hdfs.server.namenode.ha.TestInitializeSharedEdits
Tests run: 4, Failures: 0, Errors: 0, Skipped: 0, Time elapsed: 13.509 sec - in org.apache.hadoop.hdfs.server.namenode.ha.TestInitializeSharedEdits
Running org.apache.hadoop.hdfs.qjournal.client.TestIPCLoggerChannel
Tests run: 3, Failures: 0, Errors: 0, Skipped: 0, Time elapsed: 0.921 sec - in org.apache.hadoop.hdfs.qjournal.client.TestIPCLoggerChannel
Running org.apache.hadoop.hdfs.qjournal.client.TestQuorumJournalManagerUnit
Tests run: 6, Failures: 0, Errors: 0, Skipped: 0, Time elapsed: 1.182 sec - in org.apache.hadoop.hdfs.qjournal.client.TestQuorumJournalManagerUnit
Running org.apache.hadoop.hdfs.qjournal.client.TestQJMWithFaults
Tests run: 2, Failures: 0, Errors: 0, Skipped: 0, Time elapsed: 187.929 sec - in org.apache.hadoop.hdfs.qjournal.client.TestQJMWithFaults
Running org.apache.hadoop.hdfs.qjournal.client.TestSegmentRecoveryComparator
Tests run: 1, Failures: 0, Errors: 0, Skipped: 0, Time elapsed: 0.274 sec - in org.apache.hadoop.hdfs.qjournal.client.TestSegmentRecoveryComparator
Running org.apache.hadoop.hdfs.qjournal.client.TestEpochsAreUnique
Tests run: 1, Failures: 0, Errors: 0, Skipped: 0, Time elapsed: 7.251 sec - in org.apache.hadoop.hdfs.qjournal.client.TestEpochsAreUnique
Running org.apache.hadoop.hdfs.qjournal.client.TestQuorumCall
Tests run: 1, Failures: 0, Errors: 0, Skipped: 0, Time elapsed: 0.238 sec - in org.apache.hadoop.hdfs.qjournal.client.TestQuorumCall
Running org.apache.hadoop.hdfs.qjournal.client.TestQuorumJournalManager
Tests run: 21, Failures: 0, Errors: 0, Skipped: 0, Time elapsed: 27.992 sec - in org.apache.hadoop.hdfs.qjournal.client.TestQuorumJournalManager
Running org.apache.hadoop.hdfs.qjournal.TestMiniJournalCluster
Tests run: 1, Failures: 0, Errors: 0, Skipped: 0, Time elapsed: 1.339 sec - in org.apache.hadoop.hdfs.qjournal.TestMiniJournalCluster
Running org.apache.hadoop.hdfs.qjournal.server.TestJournal
Tests run: 12, Failures: 0, Errors: 0, Skipped: 0, Time elapsed: 2.26 sec - in org.apache.hadoop.hdfs.qjournal.server.TestJournal
Running org.apache.hadoop.hdfs.qjournal.server.TestJournalNode
Tests run: 6, Failures: 0, Errors: 0, Skipped: 0, Time elapsed: 6.019 sec - in org.apache.hadoop.hdfs.qjournal.server.TestJournalNode
Running org.apache.hadoop.hdfs.qjournal.server.TestJournalNodeMXBean
Tests run: 1, Failures: 0, Errors: 0, Skipped: 0, Time elapsed: 1.395 sec - in org.apache.hadoop.hdfs.qjournal.server.TestJournalNodeMXBean
Running org.apache.hadoop.hdfs.qjournal.TestNNWithQJM
Tests run: 4, Failures: 0, Errors: 0, Skipped: 0, Time elapsed: 11.071 sec - in org.apache.hadoop.hdfs.qjournal.TestNNWithQJM
Running org.apache.hadoop.hdfs.TestSetTimes
Tests run: 3, Failures: 0, Errors: 0, Skipped: 0, Time elapsed: 10.559 sec - in org.apache.hadoop.hdfs.TestSetTimes
Running org.apache.hadoop.hdfs.TestDFSStorageStateRecovery
Tests run: 3, Failures: 0, Errors: 0, Skipped: 0, Time elapsed: 117.105 sec - in org.apache.hadoop.hdfs.TestDFSStorageStateRecovery
Running org.apache.hadoop.hdfs.TestIsMethodSupported
Tests run: 10, Failures: 0, Errors: 0, Skipped: 0, Time elapsed: 4.312 sec - in org.apache.hadoop.hdfs.TestIsMethodSupported
Running org.apache.hadoop.hdfs.TestClientProtocolForPipelineRecovery
Tests run: 4, Failures: 0, Errors: 0, Skipped: 0, Time elapsed: 39.215 sec - in org.apache.hadoop.hdfs.TestClientProtocolForPipelineRecovery
Running org.apache.hadoop.hdfs.TestDFSRollback
Tests run: 1, Failures: 0, Errors: 0, Skipped: 0, Time elapsed: 19.363 sec - in org.apache.hadoop.hdfs.TestDFSRollback
Running org.apache.hadoop.hdfs.TestPread
Tests run: 6, Failures: 0, Errors: 0, Skipped: 0, Time elapsed: 104.887 sec - in org.apache.hadoop.hdfs.TestPread
Running org.apache.hadoop.hdfs.TestModTime
Tests run: 2, Failures: 0, Errors: 0, Skipped: 0, Time elapsed: 15.004 sec - in org.apache.hadoop.hdfs.TestModTime
Running org.apache.hadoop.hdfs.TestDFSShellGenericOptions
Tests run: 1, Failures: 0, Errors: 0, Skipped: 0, Time elapsed: 4.087 sec - in org.apache.hadoop.hdfs.TestDFSShellGenericOptions
Running org.apache.hadoop.hdfs.TestSmallBlock
Tests run: 2, Failures: 0, Errors: 0, Skipped: 0, Time elapsed: 5.681 sec - in org.apache.hadoop.hdfs.TestSmallBlock
Running org.apache.hadoop.hdfs.TestFileCreationClient
Tests run: 1, Failures: 0, Errors: 0, Skipped: 0, Time elapsed: 40.402 sec - in org.apache.hadoop.hdfs.TestFileCreationClient
Running org.apache.hadoop.net.TestNetworkTopology
Tests run: 10, Failures: 0, Errors: 0, Skipped: 0, Time elapsed: 8.988 sec - in org.apache.hadoop.net.TestNetworkTopology
Running org.apache.hadoop.security.TestPermission
Tests run: 3, Failures: 0, Errors: 0, Skipped: 0, Time elapsed: 5.829 sec - in org.apache.hadoop.security.TestPermission
Running org.apache.hadoop.security.TestRefreshUserMappings
Tests run: 2, Failures: 0, Errors: 0, Skipped: 0, Time elapsed: 6.289 sec - in org.apache.hadoop.security.TestRefreshUserMappings
Running org.apache.hadoop.security.TestPermissionSymlinks
Tests run: 14, Failures: 0, Errors: 0, Skipped: 0, Time elapsed: 5.17 sec - in org.apache.hadoop.security.TestPermissionSymlinks
Running org.apache.hadoop.cli.TestHDFSCLI
Tests run: 1, Failures: 0, Errors: 0, Skipped: 0, Time elapsed: 65.722 sec - in org.apache.hadoop.cli.TestHDFSCLI
Running org.apache.hadoop.cli.TestAclCLI
Tests run: 1, Failures: 0, Errors: 0, Skipped: 0, Time elapsed: 6.153 sec - in org.apache.hadoop.cli.TestAclCLI
Running org.apache.hadoop.cli.TestCacheAdminCLI
Tests run: 1, Failures: 0, Errors: 0, Skipped: 0, Time elapsed: 6.631 sec - in org.apache.hadoop.cli.TestCacheAdminCLI
Running org.apache.hadoop.tools.TestJMXGet
Tests run: 2, Failures: 0, Errors: 0, Skipped: 0, Time elapsed: 4.909 sec - in org.apache.hadoop.tools.TestJMXGet
Running org.apache.hadoop.tools.TestTools
Tests run: 5, Failures: 0, Errors: 0, Skipped: 0, Time elapsed: 1.126 sec - in org.apache.hadoop.tools.TestTools

Results :

Tests in error: 
  TestFileAppend4.testCompleteOtherLeaseHoldersFile:266->recoverFile:128 ยป  test...

Tests run: 2656, Failures: 0, Errors: 1, Skipped: 17

[INFO]                                                                         
[INFO] ------------------------------------------------------------------------
[INFO] Skipping Apache Hadoop HttpFS
[INFO] This project has been banned from the build due to previous failures.
[INFO] ------------------------------------------------------------------------
[INFO]                                                                         
[INFO] ------------------------------------------------------------------------
[INFO] Skipping Apache Hadoop HDFS BookKeeper Journal
[INFO] This project has been banned from the build due to previous failures.
[INFO] ------------------------------------------------------------------------
[INFO]                                                                         
[INFO] ------------------------------------------------------------------------
[INFO] Skipping Apache Hadoop HDFS-NFS
[INFO] This project has been banned from the build due to previous failures.
[INFO] ------------------------------------------------------------------------
[INFO]                                                                         
[INFO] ------------------------------------------------------------------------
[INFO] Building Apache Hadoop HDFS Project 3.0.0-SNAPSHOT
[INFO] ------------------------------------------------------------------------
[WARNING] The POM for org.eclipse.m2e:lifecycle-mapping:jar:1.0.0 is missing, no dependency
information available
[WARNING] Failed to retrieve plugin descriptor for org.eclipse.m2e:lifecycle-mapping:1.0.0:
Plugin org.eclipse.m2e:lifecycle-mapping:1.0.0 or one of its dependencies could not be resolved:
Failed to read artifact descriptor for org.eclipse.m2e:lifecycle-mapping:jar:1.0.0
[INFO] 
[INFO] --- maven-clean-plugin:2.4.1:clean (default-clean) @ hadoop-hdfs-project ---
[INFO] Deleting <https://builds.apache.org/job/Hadoop-Hdfs-trunk/ws/trunk/hadoop-hdfs-project/target>
[INFO] 
[INFO] --- maven-antrun-plugin:1.7:run (create-testdirs) @ hadoop-hdfs-project ---
[INFO] Executing tasks

main:
    [mkdir] Created dir: <https://builds.apache.org/job/Hadoop-Hdfs-trunk/ws/trunk/hadoop-hdfs-project/target/test-dir>
[INFO] Executed tasks
[INFO] 
[INFO] --- maven-source-plugin:2.1.2:jar-no-fork (hadoop-java-sources) @ hadoop-hdfs-project
---
[INFO] 
[INFO] --- maven-source-plugin:2.1.2:test-jar-no-fork (hadoop-java-sources) @ hadoop-hdfs-project
---
[INFO] 
[INFO] --- maven-enforcer-plugin:1.3.1:enforce (dist-enforce) @ hadoop-hdfs-project ---
[INFO] 
[INFO] --- maven-site-plugin:3.3:attach-descriptor (attach-descriptor) @ hadoop-hdfs-project
---
[INFO] 
[INFO] --- maven-javadoc-plugin:2.8.1:jar (module-javadocs) @ hadoop-hdfs-project ---
[INFO] Not executing Javadoc as the project is not a Java classpath-capable package
[INFO] 
[INFO] --- maven-enforcer-plugin:1.3.1:enforce (depcheck) @ hadoop-hdfs-project ---
[INFO] 
[INFO] --- maven-checkstyle-plugin:2.6:checkstyle (default-cli) @ hadoop-hdfs-project ---
[INFO] 
[INFO] --- findbugs-maven-plugin:2.3.2:findbugs (default-cli) @ hadoop-hdfs-project ---
[INFO] ****** FindBugsMojo execute *******
[INFO] canGenerate is false
[INFO] ------------------------------------------------------------------------
[INFO] Reactor Summary:
[INFO] 
[INFO] Apache Hadoop HDFS ................................ FAILURE [2:11:39.701s]
[INFO] Apache Hadoop HttpFS .............................. SKIPPED
[INFO] Apache Hadoop HDFS BookKeeper Journal ............. SKIPPED
[INFO] Apache Hadoop HDFS-NFS ............................ SKIPPED
[INFO] Apache Hadoop HDFS Project ........................ SUCCESS [5.974s]
[INFO] ------------------------------------------------------------------------
[INFO] BUILD FAILURE
[INFO] ------------------------------------------------------------------------
[INFO] Total time: 2:11:47.180s
[INFO] Finished at: Fri Apr 11 13:47:35 UTC 2014
[INFO] Final Memory: 38M/338M
[INFO] ------------------------------------------------------------------------
[ERROR] Failed to execute goal org.apache.maven.plugins:maven-surefire-plugin:2.16:test (default-test)
on project hadoop-hdfs: There are test failures.
[ERROR] 
[ERROR] Please refer to <https://builds.apache.org/job/Hadoop-Hdfs-trunk/ws/trunk/hadoop-hdfs-project/hadoop-hdfs/target/surefire-reports>
for the individual test results.
[ERROR] -> [Help 1]
[ERROR] 
[ERROR] To see the full stack trace of the errors, re-run Maven with the -e switch.
[ERROR] Re-run Maven using the -X switch to enable full debug logging.
[ERROR] 
[ERROR] For more information about the errors and possible solutions, please read the following
articles:
[ERROR] [Help 1] http://cwiki.apache.org/confluence/display/MAVEN/MojoFailureException
Build step 'Execute shell' marked build as failure
Archiving artifacts
Recording test results
Updating HDFS-6231
Updating HADOOP-10488
Updating HADOOP-10350
Updating HADOOP-10490
Updating YARN-1920
Updating HDFS-5669
Updating YARN-1924
Updating YARN-1926
Updating YARN-1903
Updating YARN-1914
Updating HDFS-6224
Updating MAPREDUCE-5826
Updating MAPREDUCE-5815
Updating MAPREDUCE-5825

Mime
View raw message