hadoop-hdfs-dev mailing list archives

Site index · List index
Message view « Date » · « Thread »
Top « Date » · « Thread »
From Apache Jenkins Server <jenk...@builds.apache.org>
Subject Hadoop-Hdfs-trunk - Build # 1674 - Still Failing
Date Sat, 15 Feb 2014 13:32:52 GMT
See https://builds.apache.org/job/Hadoop-Hdfs-trunk/1674/

###################################################################################
########################## LAST 60 LINES OF THE CONSOLE ###########################
[...truncated 12841 lines...]
[INFO] --- maven-source-plugin:2.1.2:jar-no-fork (hadoop-java-sources) @ hadoop-hdfs-project
---
[INFO] 
[INFO] --- maven-source-plugin:2.1.2:test-jar-no-fork (hadoop-java-sources) @ hadoop-hdfs-project
---
[INFO] 
[INFO] --- maven-enforcer-plugin:1.3.1:enforce (dist-enforce) @ hadoop-hdfs-project ---
[INFO] 
[INFO] --- maven-site-plugin:3.3:attach-descriptor (attach-descriptor) @ hadoop-hdfs-project
---
[INFO] 
[INFO] --- maven-javadoc-plugin:2.8.1:jar (module-javadocs) @ hadoop-hdfs-project ---
[INFO] Not executing Javadoc as the project is not a Java classpath-capable package
[INFO] 
[INFO] --- maven-enforcer-plugin:1.3.1:enforce (depcheck) @ hadoop-hdfs-project ---
[INFO] 
[INFO] --- maven-checkstyle-plugin:2.6:checkstyle (default-cli) @ hadoop-hdfs-project ---
[INFO] 
[INFO] --- findbugs-maven-plugin:2.3.2:findbugs (default-cli) @ hadoop-hdfs-project ---
[INFO] ****** FindBugsMojo execute *******
[INFO] canGenerate is false
[INFO] ------------------------------------------------------------------------
[INFO] Reactor Summary:
[INFO] 
[INFO] Apache Hadoop HDFS ................................ FAILURE [1:56:46.785s]
[INFO] Apache Hadoop HttpFS .............................. SKIPPED
[INFO] Apache Hadoop HDFS BookKeeper Journal ............. SKIPPED
[INFO] Apache Hadoop HDFS-NFS ............................ SKIPPED
[INFO] Apache Hadoop HDFS Project ........................ SUCCESS [2.823s]
[INFO] ------------------------------------------------------------------------
[INFO] BUILD FAILURE
[INFO] ------------------------------------------------------------------------
[INFO] Total time: 1:56:51.151s
[INFO] Finished at: Sat Feb 15 13:32:29 UTC 2014
[INFO] Final Memory: 39M/312M
[INFO] ------------------------------------------------------------------------
[ERROR] Failed to execute goal org.apache.maven.plugins:maven-surefire-plugin:2.16:test (default-test)
on project hadoop-hdfs: There are test failures.
[ERROR] 
[ERROR] Please refer to /home/jenkins/jenkins-slave/workspace/Hadoop-Hdfs-trunk/trunk/hadoop-hdfs-project/hadoop-hdfs/target/surefire-reports
for the individual test results.
[ERROR] -> [Help 1]
[ERROR] 
[ERROR] To see the full stack trace of the errors, re-run Maven with the -e switch.
[ERROR] Re-run Maven using the -X switch to enable full debug logging.
[ERROR] 
[ERROR] For more information about the errors and possible solutions, please read the following
articles:
[ERROR] [Help 1] http://cwiki.apache.org/confluence/display/MAVEN/MojoFailureException
Build step 'Execute shell' marked build as failure
Archiving artifacts
Recording test results
Updating HDFS-3128
Updating HDFS-5943
Updating HDFS-5953
Updating HDFS-5749
Updating HDFS-5698
Updating YARN-1553
Updating HDFS-5949
Updating HDFS-5716
Updating HDFS-5948
Updating HADOOP-10342
Sending e-mails to: hdfs-dev@hadoop.apache.org
Email was triggered for: Failure
Sending email for trigger: Failure



###################################################################################
############################## FAILED TESTS (if any) ##############################
1 tests failed.
REGRESSION:  org.apache.hadoop.hdfs.server.namenode.ha.TestHASafeMode.testBlocksAddedWhileStandbyIsDown

Error Message:
Bad safemode status: 'Safe mode is ON. The reported blocks 9 has reached the threshold 0.9990
of total blocks 6. The number of live datanodes 3 has reached the minimum number 0. Safe mode
will be turned off automatically in 28 seconds.'

Stack Trace:
java.lang.AssertionError: Bad safemode status: 'Safe mode is ON. The reported blocks 9 has
reached the threshold 0.9990 of total blocks 6. The number of live datanodes 3 has reached
the minimum number 0. Safe mode will be turned off automatically in 28 seconds.'
	at org.junit.Assert.fail(Assert.java:93)
	at org.junit.Assert.assertTrue(Assert.java:43)
	at org.apache.hadoop.hdfs.server.namenode.ha.TestHASafeMode.assertSafeMode(TestHASafeMode.java:493)
	at org.apache.hadoop.hdfs.server.namenode.ha.TestHASafeMode.testBlocksAddedWhileStandbyIsDown(TestHASafeMode.java:660)



Mime
  • Unnamed multipart/mixed (inline, None, 0 bytes)
View raw message