hadoop-hdfs-dev mailing list archives

Site index · List index
Message view « Date » · « Thread »
Top « Date » · « Thread »
From Ted Yu <yuzhih...@gmail.com>
Subject Re: Build failed in Jenkins: Hadoop-Hdfs-trunk #1552
Date Mon, 14 Oct 2013 22:41:24 GMT
I noticed test failures in 'Hadoop HDFS' caused tests in other modules to
be skipped:

[INFO] Apache Hadoop HDFS ................................ FAILURE
[1:44:29.257s]
[INFO] Apache Hadoop HttpFS .............................. SKIPPED
[INFO] Apache Hadoop HDFS BookKeeper Journal ............. SKIPPED
[INFO] Apache Hadoop HDFS-NFS ............................ SKIPPED

Should we apply '--fail-at-end' maven option so that all tests are run ?

See http://maven.apache.org/guides/mini/guide-multiple-modules.html

Cheers


On Mon, Oct 14, 2013 at 6:19 AM, Apache Jenkins Server <
jenkins@builds.apache.org> wrote:

> See <https://builds.apache.org/job/Hadoop-Hdfs-trunk/1552/changes>
>
> Changes:
>
> [sandy] MAPREDUCE-5463. Deprecate SLOTS_MILLIS counters. (Tzuyoshi Ozawa
> via Sandy Ryza)
>
> [sandy] YARN-305. Fair scheduler logs too many "Node offered to app"
> messages. (Lohit Vijayarenu via Sandy Ryza)
>
> [sseth] MAPREDUCE-5329. Allow MR applications to use additional
> AuxServices, which are compatible with the default MapReduce shuffle.
> Contributed by Avner BenHanoch.
>
> ------------------------------------------
> [...truncated 11425 lines...]
> Tests run: 2, Failures: 0, Errors: 0, Skipped: 0, Time elapsed: 26.954 sec
> - in org.apache.hadoop.hdfs.TestSetrepIncreasing
> Running org.apache.hadoop.hdfs.TestEncryptedTransfer
> Tests run: 12, Failures: 0, Errors: 0, Skipped: 0, Time elapsed: 79.573
> sec - in org.apache.hadoop.hdfs.TestEncryptedTransfer
> Running org.apache.hadoop.hdfs.TestDFSUpgrade
> Tests run: 2, Failures: 0, Errors: 0, Skipped: 0, Time elapsed: 34.229 sec
> - in org.apache.hadoop.hdfs.TestDFSUpgrade
> Running org.apache.hadoop.hdfs.TestCrcCorruption
> Tests run: 4, Failures: 0, Errors: 0, Skipped: 0, Time elapsed: 32.306 sec
> - in org.apache.hadoop.hdfs.TestCrcCorruption
> Running org.apache.hadoop.hdfs.TestHFlush
> Tests run: 9, Failures: 0, Errors: 0, Skipped: 0, Time elapsed: 26.177 sec
> - in org.apache.hadoop.hdfs.TestHFlush
> Running org.apache.hadoop.hdfs.TestFileAppendRestart
> Tests run: 3, Failures: 0, Errors: 0, Skipped: 0, Time elapsed: 11.167 sec
> - in org.apache.hadoop.hdfs.TestFileAppendRestart
> Running org.apache.hadoop.hdfs.TestDatanodeReport
> Tests run: 1, Failures: 0, Errors: 0, Skipped: 0, Time elapsed: 19.518 sec
> - in org.apache.hadoop.hdfs.TestDatanodeReport
> Running org.apache.hadoop.hdfs.TestShortCircuitLocalRead
> Tests run: 10, Failures: 0, Errors: 0, Skipped: 10, Time elapsed: 0.195
> sec - in org.apache.hadoop.hdfs.TestShortCircuitLocalRead
> Running org.apache.hadoop.hdfs.TestFileInputStreamCache
> Tests run: 4, Failures: 0, Errors: 0, Skipped: 0, Time elapsed: 1.205 sec
> - in org.apache.hadoop.hdfs.TestFileInputStreamCache
> Running org.apache.hadoop.hdfs.TestRestartDFS
> Tests run: 2, Failures: 0, Errors: 0, Skipped: 0, Time elapsed: 11.3 sec -
> in org.apache.hadoop.hdfs.TestRestartDFS
> Running org.apache.hadoop.hdfs.TestDFSUpgradeFromImage
> Tests run: 4, Failures: 0, Errors: 0, Skipped: 0, Time elapsed: 15.577 sec
> - in org.apache.hadoop.hdfs.TestDFSUpgradeFromImage
> Running org.apache.hadoop.hdfs.TestDFSRemove
> Tests run: 1, Failures: 0, Errors: 0, Skipped: 0, Time elapsed: 13.897 sec
> - in org.apache.hadoop.hdfs.TestDFSRemove
> Running org.apache.hadoop.hdfs.TestHDFSTrash
> Tests run: 2, Failures: 0, Errors: 0, Skipped: 0, Time elapsed: 4.345 sec
> - in org.apache.hadoop.hdfs.TestHDFSTrash
> Running org.apache.hadoop.hdfs.TestClientReportBadBlock
> Tests run: 3, Failures: 0, Errors: 0, Skipped: 0, Time elapsed: 63.52 sec
> - in org.apache.hadoop.hdfs.TestClientReportBadBlock
> Running org.apache.hadoop.hdfs.TestQuota
> Tests run: 7, Failures: 0, Errors: 0, Skipped: 0, Time elapsed: 12.236 sec
> - in org.apache.hadoop.hdfs.TestQuota
> Running org.apache.hadoop.hdfs.TestFileLengthOnClusterRestart
> Tests run: 1, Failures: 0, Errors: 0, Skipped: 0, Time elapsed: 13.421 sec
> - in org.apache.hadoop.hdfs.TestFileLengthOnClusterRestart
> Running org.apache.hadoop.hdfs.TestDatanodeRegistration
> Tests run: 5, Failures: 0, Errors: 0, Skipped: 0, Time elapsed: 8.058 sec
> - in org.apache.hadoop.hdfs.TestDatanodeRegistration
> Running org.apache.hadoop.hdfs.TestAbandonBlock
> Tests run: 2, Failures: 0, Errors: 0, Skipped: 0, Time elapsed: 13.214 sec
> - in org.apache.hadoop.hdfs.TestAbandonBlock
> Running org.apache.hadoop.hdfs.TestDFSShell
> Tests run: 23, Failures: 0, Errors: 0, Skipped: 0, Time elapsed: 25.489
> sec - in org.apache.hadoop.hdfs.TestDFSShell
> Running org.apache.hadoop.hdfs.TestListFilesInDFS
> Tests run: 2, Failures: 0, Errors: 0, Skipped: 0, Time elapsed: 3.339 sec
> - in org.apache.hadoop.hdfs.TestListFilesInDFS
> Running org.apache.hadoop.hdfs.TestParallelShortCircuitReadUnCached
> Tests run: 4, Failures: 0, Errors: 0, Skipped: 4, Time elapsed: 0.163 sec
> - in org.apache.hadoop.hdfs.TestParallelShortCircuitReadUnCached
> Running org.apache.hadoop.hdfs.TestPeerCache
> Tests run: 5, Failures: 0, Errors: 0, Skipped: 0, Time elapsed: 1.317 sec
> - in org.apache.hadoop.hdfs.TestPeerCache
> Running org.apache.hadoop.hdfs.TestAppendDifferentChecksum
> Tests run: 3, Failures: 0, Errors: 0, Skipped: 1, Time elapsed: 8.434 sec
> - in org.apache.hadoop.hdfs.TestAppendDifferentChecksum
> Running org.apache.hadoop.hdfs.TestDFSClientExcludedNodes
> Tests run: 2, Failures: 0, Errors: 0, Skipped: 0, Time elapsed: 10.008 sec
> - in org.apache.hadoop.hdfs.TestDFSClientExcludedNodes
> Running org.apache.hadoop.hdfs.TestDatanodeBlockScanner
> Tests run: 7, Failures: 0, Errors: 0, Skipped: 0, Time elapsed: 152.644
> sec - in org.apache.hadoop.hdfs.TestDatanodeBlockScanner
> Running org.apache.hadoop.hdfs.TestMultiThreadedHflush
> Tests run: 3, Failures: 0, Errors: 0, Skipped: 0, Time elapsed: 8.954 sec
> - in org.apache.hadoop.hdfs.TestMultiThreadedHflush
> Running org.apache.hadoop.hdfs.TestDFSAddressConfig
> Tests run: 1, Failures: 0, Errors: 0, Skipped: 0, Time elapsed: 3.984 sec
> - in org.apache.hadoop.hdfs.TestDFSAddressConfig
> Running org.apache.hadoop.hdfs.TestMiniDFSCluster
> Tests run: 4, Failures: 0, Errors: 0, Skipped: 0, Time elapsed: 6.416 sec
> - in org.apache.hadoop.hdfs.TestMiniDFSCluster
> Running org.apache.hadoop.hdfs.TestLease
> Tests run: 4, Failures: 0, Errors: 0, Skipped: 0, Time elapsed: 6.635 sec
> - in org.apache.hadoop.hdfs.TestLease
> Running org.apache.hadoop.hdfs.TestListFilesInFileContext
> Tests run: 3, Failures: 0, Errors: 0, Skipped: 0, Time elapsed: 3.309 sec
> - in org.apache.hadoop.hdfs.TestListFilesInFileContext
> Running org.apache.hadoop.hdfs.TestDFSShellGenericOptions
> Tests run: 1, Failures: 0, Errors: 0, Skipped: 0, Time elapsed: 3.663 sec
> - in org.apache.hadoop.hdfs.TestDFSShellGenericOptions
> Running org.apache.hadoop.hdfs.TestDFSClientFailover
> Tests run: 6, Failures: 0, Errors: 0, Skipped: 2, Time elapsed: 10.39 sec
> - in org.apache.hadoop.hdfs.TestDFSClientFailover
> Running org.apache.hadoop.hdfs.TestFileAppend2
> Tests run: 2, Failures: 0, Errors: 0, Skipped: 0, Time elapsed: 13.319 sec
> - in org.apache.hadoop.hdfs.TestFileAppend2
> Running org.apache.hadoop.hdfs.TestLocalDFS
> Tests run: 1, Failures: 0, Errors: 0, Skipped: 0, Time elapsed: 4.159 sec
> - in org.apache.hadoop.hdfs.TestLocalDFS
> Running org.apache.hadoop.hdfs.TestReadWhileWriting
> Tests run: 1, Failures: 0, Errors: 0, Skipped: 0, Time elapsed: 6.298 sec
> - in org.apache.hadoop.hdfs.TestReadWhileWriting
> Running org.apache.hadoop.hdfs.TestSeekBug
> Tests run: 4, Failures: 0, Errors: 0, Skipped: 0, Time elapsed: 5.443 sec
> - in org.apache.hadoop.hdfs.TestSeekBug
> Running org.apache.hadoop.hdfs.TestBlocksScheduledCounter
> Tests run: 1, Failures: 0, Errors: 0, Skipped: 0, Time elapsed: 2.984 sec
> - in org.apache.hadoop.hdfs.TestBlocksScheduledCounter
> Running org.apache.hadoop.hdfs.util.TestChunkedArrayList
> Tests run: 3, Failures: 0, Errors: 0, Skipped: 0, Time elapsed: 0.39 sec -
> in org.apache.hadoop.hdfs.util.TestChunkedArrayList
> Running org.apache.hadoop.hdfs.util.TestBestEffortLongFile
> Tests run: 2, Failures: 0, Errors: 0, Skipped: 0, Time elapsed: 0.199 sec
> - in org.apache.hadoop.hdfs.util.TestBestEffortLongFile
> Running org.apache.hadoop.hdfs.util.TestAtomicFileOutputStream
> Tests run: 3, Failures: 0, Errors: 0, Skipped: 0, Time elapsed: 0.18 sec -
> in org.apache.hadoop.hdfs.util.TestAtomicFileOutputStream
> Running org.apache.hadoop.hdfs.util.TestExactSizeInputStream
> Tests run: 7, Failures: 0, Errors: 0, Skipped: 0, Time elapsed: 0.059 sec
> - in org.apache.hadoop.hdfs.util.TestExactSizeInputStream
> Running org.apache.hadoop.hdfs.util.TestDiff
> Tests run: 1, Failures: 0, Errors: 0, Skipped: 0, Time elapsed: 4.333 sec
> - in org.apache.hadoop.hdfs.util.TestDiff
> Running org.apache.hadoop.hdfs.util.TestMD5FileUtils
> Tests run: 5, Failures: 0, Errors: 0, Skipped: 0, Time elapsed: 0.226 sec
> - in org.apache.hadoop.hdfs.util.TestMD5FileUtils
> Running org.apache.hadoop.hdfs.util.TestDirectBufferPool
> Tests run: 3, Failures: 0, Errors: 0, Skipped: 0, Time elapsed: 0.103 sec
> - in org.apache.hadoop.hdfs.util.TestDirectBufferPool
> Running org.apache.hadoop.hdfs.util.TestLightWeightHashSet
> Tests run: 13, Failures: 0, Errors: 0, Skipped: 0, Time elapsed: 0.158 sec
> - in org.apache.hadoop.hdfs.util.TestLightWeightHashSet
> Running org.apache.hadoop.hdfs.util.TestXMLUtils
> Tests run: 5, Failures: 0, Errors: 0, Skipped: 0, Time elapsed: 0.059 sec
> - in org.apache.hadoop.hdfs.util.TestXMLUtils
> Running org.apache.hadoop.hdfs.util.TestCyclicIteration
> Tests run: 1, Failures: 0, Errors: 0, Skipped: 0, Time elapsed: 0.059 sec
> - in org.apache.hadoop.hdfs.util.TestCyclicIteration
> Running org.apache.hadoop.hdfs.util.TestLightWeightLinkedSet
> Tests run: 17, Failures: 0, Errors: 0, Skipped: 0, Time elapsed: 0.164 sec
> - in org.apache.hadoop.hdfs.util.TestLightWeightLinkedSet
> Running org.apache.hadoop.hdfs.TestSetTimes
> Tests run: 3, Failures: 0, Errors: 0, Skipped: 0, Time elapsed: 9.415 sec
> - in org.apache.hadoop.hdfs.TestSetTimes
> Running org.apache.hadoop.hdfs.TestParallelShortCircuitReadNoChecksum
> Tests run: 4, Failures: 0, Errors: 0, Skipped: 4, Time elapsed: 0.162 sec
> - in org.apache.hadoop.hdfs.TestParallelShortCircuitReadNoChecksum
> Running org.apache.hadoop.hdfs.TestBlockReaderLocal
> Tests run: 11, Failures: 0, Errors: 0, Skipped: 2, Time elapsed: 11.946
> sec - in org.apache.hadoop.hdfs.TestBlockReaderLocal
> Running org.apache.hadoop.hdfs.TestHftpURLTimeouts
> Tests run: 2, Failures: 0, Errors: 0, Skipped: 0, Time elapsed: 0.973 sec
> - in org.apache.hadoop.hdfs.TestHftpURLTimeouts
> Running org.apache.hadoop.cli.TestHDFSCLI
> Tests run: 1, Failures: 0, Errors: 0, Skipped: 0, Time elapsed: 48.825 sec
> - in org.apache.hadoop.cli.TestHDFSCLI
> Running org.apache.hadoop.fs.TestHdfsNativeCodeLoader
> Tests run: 1, Failures: 0, Errors: 0, Skipped: 0, Time elapsed: 0.131 sec
> - in org.apache.hadoop.fs.TestHdfsNativeCodeLoader
> Running org.apache.hadoop.fs.TestGlobPaths
> Tests run: 31, Failures: 0, Errors: 0, Skipped: 6, Time elapsed: 4.375 sec
> - in org.apache.hadoop.fs.TestGlobPaths
> Running org.apache.hadoop.fs.TestResolveHdfsSymlink
> Tests run: 4, Failures: 0, Errors: 0, Skipped: 0, Time elapsed: 3.4 sec -
> in org.apache.hadoop.fs.TestResolveHdfsSymlink
> Running org.apache.hadoop.fs.TestFcHdfsSetUMask
> Tests run: 12, Failures: 0, Errors: 0, Skipped: 0, Time elapsed: 3.497 sec
> - in org.apache.hadoop.fs.TestFcHdfsSetUMask
> Running org.apache.hadoop.fs.TestFcHdfsPermission
> Tests run: 4, Failures: 0, Errors: 0, Skipped: 0, Time elapsed: 3.483 sec
> - in org.apache.hadoop.fs.TestFcHdfsPermission
> Running org.apache.hadoop.fs.TestUrlStreamHandler
> Tests run: 2, Failures: 0, Errors: 0, Skipped: 0, Time elapsed: 3.508 sec
> - in org.apache.hadoop.fs.TestUrlStreamHandler
> Running org.apache.hadoop.fs.viewfs.TestViewFsDefaultValue
> Tests run: 4, Failures: 0, Errors: 0, Skipped: 0, Time elapsed: 2.95 sec -
> in org.apache.hadoop.fs.viewfs.TestViewFsDefaultValue
> Running org.apache.hadoop.fs.viewfs.TestViewFileSystemAtHdfsRoot
> Tests run: 39, Failures: 0, Errors: 0, Skipped: 0, Time elapsed: 6.601 sec
> - in org.apache.hadoop.fs.viewfs.TestViewFileSystemAtHdfsRoot
> Running org.apache.hadoop.fs.viewfs.TestViewFsHdfs
> Tests run: 42, Failures: 0, Errors: 0, Skipped: 0, Time elapsed: 5.992 sec
> - in org.apache.hadoop.fs.viewfs.TestViewFsHdfs
> Running org.apache.hadoop.fs.viewfs.TestViewFsAtHdfsRoot
> Tests run: 42, Failures: 0, Errors: 0, Skipped: 0, Time elapsed: 6.34 sec
> - in org.apache.hadoop.fs.viewfs.TestViewFsAtHdfsRoot
> Running org.apache.hadoop.fs.viewfs.TestViewFileSystemHdfs
> Tests run: 39, Failures: 0, Errors: 0, Skipped: 0, Time elapsed: 7.368 sec
> - in org.apache.hadoop.fs.viewfs.TestViewFileSystemHdfs
> Running org.apache.hadoop.fs.viewfs.TestViewFsFileStatusHdfs
> Tests run: 2, Failures: 0, Errors: 0, Skipped: 0, Time elapsed: 3.048 sec
> - in org.apache.hadoop.fs.viewfs.TestViewFsFileStatusHdfs
> Running org.apache.hadoop.fs.permission.TestStickyBit
> Tests run: 3, Failures: 0, Errors: 0, Skipped: 0, Time elapsed: 8.024 sec
> - in org.apache.hadoop.fs.permission.TestStickyBit
> Running org.apache.hadoop.fs.loadGenerator.TestLoadGenerator
> Tests run: 2, Failures: 0, Errors: 0, Skipped: 0, Time elapsed: 14.213 sec
> - in org.apache.hadoop.fs.loadGenerator.TestLoadGenerator
> Running org.apache.hadoop.fs.TestSymlinkHdfsFileContext
> Tests run: 69, Failures: 0, Errors: 0, Skipped: 0, Time elapsed: 7.883 sec
> - in org.apache.hadoop.fs.TestSymlinkHdfsFileContext
> Running org.apache.hadoop.fs.shell.TestHdfsTextCommand
> Tests run: 1, Failures: 0, Errors: 0, Skipped: 0, Time elapsed: 3.573 sec
> - in org.apache.hadoop.fs.shell.TestHdfsTextCommand
> Running org.apache.hadoop.fs.TestFcHdfsCreateMkdir
> Tests run: 8, Failures: 0, Errors: 0, Skipped: 0, Time elapsed: 3.414 sec
> - in org.apache.hadoop.fs.TestFcHdfsCreateMkdir
> Running org.apache.hadoop.fs.TestHDFSFileContextMainOperations
> Tests run: 60, Failures: 0, Errors: 0, Skipped: 0, Time elapsed: 6.514 sec
> - in org.apache.hadoop.fs.TestHDFSFileContextMainOperations
> Running org.apache.hadoop.fs.TestEnhancedByteBufferAccess
> Tests run: 7, Failures: 0, Errors: 0, Skipped: 6, Time elapsed: 0.211 sec
> - in org.apache.hadoop.fs.TestEnhancedByteBufferAccess
> Running org.apache.hadoop.fs.TestSymlinkHdfsDisable
> Tests run: 1, Failures: 0, Errors: 0, Skipped: 0, Time elapsed: 3.043 sec
> - in org.apache.hadoop.fs.TestSymlinkHdfsDisable
> Running org.apache.hadoop.fs.TestVolumeId
> Tests run: 4, Failures: 0, Errors: 0, Skipped: 0, Time elapsed: 0.067 sec
> - in org.apache.hadoop.fs.TestVolumeId
> Running org.apache.hadoop.fs.TestSymlinkHdfsFileSystem
> Tests run: 72, Failures: 0, Errors: 0, Skipped: 2, Time elapsed: 7.973 sec
> - in org.apache.hadoop.fs.TestSymlinkHdfsFileSystem
>
> Results :
>
> Failed tests:
>   TestQuorumJournalManager.shutdown:108 Leaked thread: "IPC Client
> (4059123) connection to /127.0.0.1:57570 from jenkins" Id=87 RUNNABLE
>         at org.apache.hadoop.io.IOUtils.closeStream(IOUtils.java:256)
>         at org.apache.hadoop.ipc.Client$Connection.close(Client.java:1137)
>         at org.apache.hadoop.ipc.Client$Connection.run(Client.java:954)
>
>
> org.apache.hadoop.io.IOUtils.closeStream(IOUtils.java:256)
> org.apache.hadoop.ipc.Client$Connection.close(Client.java:1137)
> org.apache.hadoop.ipc.Client$Connection.run(Client.java:954)
>
> Tests in error:
>   TestWebHdfsFileSystemContract.testResponseCode:465 » IO All datanodes
> 127.0.0....
>
> TestWebHdfsFileSystemContract>FileSystemContractBaseTest.testWriteReadAndDeleteOneBlock:244->FileSystemContractBaseTest.writeReadAndDelete:263->FileSystemContractBaseTest.writeAndRead:797
> » SocketTimeout
>
> Tests run: 2128, Failures: 1, Errors: 2, Skipped: 50
>
> [INFO]
> [INFO]
> ------------------------------------------------------------------------
> [INFO] Skipping Apache Hadoop HttpFS
> [INFO] This project has been banned from the build due to previous
> failures.
> [INFO]
> ------------------------------------------------------------------------
> [INFO]
> [INFO]
> ------------------------------------------------------------------------
> [INFO] Skipping Apache Hadoop HDFS BookKeeper Journal
> [INFO] This project has been banned from the build due to previous
> failures.
> [INFO]
> ------------------------------------------------------------------------
> [INFO]
> [INFO]
> ------------------------------------------------------------------------
> [INFO] Skipping Apache Hadoop HDFS-NFS
> [INFO] This project has been banned from the build due to previous
> failures.
> [INFO]
> ------------------------------------------------------------------------
> [INFO]
> [INFO]
> ------------------------------------------------------------------------
> [INFO] Building Apache Hadoop HDFS Project 3.0.0-SNAPSHOT
> [INFO]
> ------------------------------------------------------------------------
> [WARNING] The POM for org.eclipse.m2e:lifecycle-mapping:jar:1.0.0 is
> missing, no dependency information available
> [WARNING] Failed to retrieve plugin descriptor for
> org.eclipse.m2e:lifecycle-mapping:1.0.0: Plugin
> org.eclipse.m2e:lifecycle-mapping:1.0.0 or one of its dependencies could
> not be resolved: Failed to read artifact descriptor for
> org.eclipse.m2e:lifecycle-mapping:jar:1.0.0
> [INFO]
> [INFO] --- maven-clean-plugin:2.4.1:clean (default-clean) @
> hadoop-hdfs-project ---
> [INFO] Deleting <
> https://builds.apache.org/job/Hadoop-Hdfs-trunk/ws/trunk/hadoop-hdfs-project/target
> >
> [INFO]
> [INFO] --- maven-antrun-plugin:1.6:run (create-testdirs) @
> hadoop-hdfs-project ---
> [INFO] Executing tasks
>
> main:
>     [mkdir] Created dir: <
> https://builds.apache.org/job/Hadoop-Hdfs-trunk/ws/trunk/hadoop-hdfs-project/target/test-dir
> >
> [INFO] Executed tasks
> [INFO]
> [INFO] --- maven-source-plugin:2.1.2:jar-no-fork (hadoop-java-sources) @
> hadoop-hdfs-project ---
> [INFO]
> [INFO] --- maven-source-plugin:2.1.2:test-jar-no-fork
> (hadoop-java-sources) @ hadoop-hdfs-project ---
> [INFO]
> [INFO] --- maven-enforcer-plugin:1.3.1:enforce (dist-enforce) @
> hadoop-hdfs-project ---
> [INFO]
> [INFO] --- maven-site-plugin:3.0:attach-descriptor (attach-descriptor) @
> hadoop-hdfs-project ---
> [INFO]
> [INFO] --- maven-javadoc-plugin:2.8.1:jar (module-javadocs) @
> hadoop-hdfs-project ---
> [INFO] Not executing Javadoc as the project is not a Java
> classpath-capable package
> [INFO]
> [INFO] --- maven-enforcer-plugin:1.3.1:enforce (depcheck) @
> hadoop-hdfs-project ---
> [INFO]
> [INFO] --- maven-checkstyle-plugin:2.6:checkstyle (default-cli) @
> hadoop-hdfs-project ---
> [INFO]
> [INFO] --- findbugs-maven-plugin:2.3.2:findbugs (default-cli) @
> hadoop-hdfs-project ---
> [INFO] ****** FindBugsMojo execute *******
> [INFO] canGenerate is false
> [INFO]
> ------------------------------------------------------------------------
> [INFO] Reactor Summary:
> [INFO]
> [INFO] Apache Hadoop HDFS ................................ FAILURE
> [1:44:29.257s]
> [INFO] Apache Hadoop HttpFS .............................. SKIPPED
> [INFO] Apache Hadoop HDFS BookKeeper Journal ............. SKIPPED
> [INFO] Apache Hadoop HDFS-NFS ............................ SKIPPED
> [INFO] Apache Hadoop HDFS Project ........................ SUCCESS [1.800s]
> [INFO]
> ------------------------------------------------------------------------
> [INFO] BUILD FAILURE
> [INFO]
> ------------------------------------------------------------------------
> [INFO] Total time: 1:44:31.893s
> [INFO] Finished at: Mon Oct 14 13:19:14 UTC 2013
> [INFO] Final Memory: 34M/402M
> [INFO]
> ------------------------------------------------------------------------
> [ERROR] Failed to execute goal
> org.apache.maven.plugins:maven-surefire-plugin:2.16:test (default-test) on
> project hadoop-hdfs: There are test failures.
> [ERROR]
> [ERROR] Please refer to <
> https://builds.apache.org/job/Hadoop-Hdfs-trunk/ws/trunk/hadoop-hdfs-project/hadoop-hdfs/target/surefire-reports>
> for the individual test results.
> [ERROR] -> [Help 1]
> [ERROR]
> [ERROR] To see the full stack trace of the errors, re-run Maven with the
> -e switch.
> [ERROR] Re-run Maven using the -X switch to enable full debug logging.
> [ERROR]
> [ERROR] For more information about the errors and possible solutions,
> please read the following articles:
> [ERROR] [Help 1]
> http://cwiki.apache.org/confluence/display/MAVEN/MojoFailureException
> Build step 'Execute shell' marked build as failure
> Archiving artifacts
> Updating MAPREDUCE-5329
> Updating MAPREDUCE-5463
> Updating YARN-305
>

Mime
  • Unnamed multipart/alternative (inline, None, 0 bytes)
View raw message